Repository navigation
feat(live): Implement CascadeLive model & sample #3885
continuous-integration.yml
on: push
Pre-commit Linter
1m 42s
Matrix: type-check
Matrix: unit-test-a2a-v0-3
Matrix: unit-test-mcp-v2
Matrix: unit-test
Annotations
24 errors, 8 warnings, and 16 notices
|
Unit Tests (Python 3.12)
FAILED tests/unittests/models/test_litellm.py::TestParseToolCallArguments::test_literal_eval_without_function_name_logs_debug - assert 0 == 1
|
|
Unit Tests (Python 3.12)
FAILED tests/unittests/models/test_litellm.py::TestParseToolCallArguments::test_literal_eval_layer_logs_debug_not_warning - assert 0 == 1
|
|
Unit Tests (Python 3.12)
FAILED tests/unittests/models/test_litellm.py::TestParseToolCallArguments::test_repaired_arguments_without_function_name - assert '{a: 1}' in 'Repaired unquoted JSON object keys in tool call arguments'
|
|
Unit Tests (Python 3.12)
FAILED tests/unittests/models/test_litellm.py::TestParseToolCallArguments::test_repaired_arguments_log_debug_with_raw_payload - assert '{a: 1}' in "WARNING google_adk.google.adk.models.lite_llm:lite_llm.py:218 Repaired unquoted JSON object keys in tool call arguments for function 'test_fn'\n"
|
|
Unit Tests (Python 3.12)
Process completed with exit code 1.
|
|
Unit Tests (Python 3.13)
FAILED tests/unittests/models/test_litellm.py::TestParseToolCallArguments::test_literal_eval_without_function_name_logs_debug - assert 0 == 1
|
|
Unit Tests (Python 3.13)
FAILED tests/unittests/models/test_litellm.py::TestParseToolCallArguments::test_literal_eval_layer_logs_debug_not_warning - assert 0 == 1
|
|
Unit Tests (Python 3.13)
FAILED tests/unittests/models/test_litellm.py::TestParseToolCallArguments::test_repaired_arguments_without_function_name - assert '{a: 1}' in 'Repaired unquoted JSON object keys in tool call arguments'
|
|
Unit Tests (Python 3.13)
FAILED tests/unittests/models/test_litellm.py::TestParseToolCallArguments::test_repaired_arguments_log_debug_with_raw_payload - assert '{a: 1}' in "WARNING google_adk.google.adk.models.lite_llm:lite_llm.py:218 Repaired unquoted JSON object keys in tool call arguments for function 'test_fn'\n"
|
|
Unit Tests (Python 3.13)
Process completed with exit code 1.
|
|
Unit Tests (Python 3.11)
FAILED tests/unittests/models/test_litellm.py::TestParseToolCallArguments::test_literal_eval_without_function_name_logs_debug - assert 0 == 1
|
|
Unit Tests (Python 3.11)
FAILED tests/unittests/models/test_litellm.py::TestParseToolCallArguments::test_literal_eval_layer_logs_debug_not_warning - assert 0 == 1
|
|
Unit Tests (Python 3.11)
FAILED tests/unittests/models/test_litellm.py::TestParseToolCallArguments::test_repaired_arguments_without_function_name - assert '{a: 1}' in 'Repaired unquoted JSON object keys in tool call arguments'
|
|
Unit Tests (Python 3.11)
FAILED tests/unittests/models/test_litellm.py::TestParseToolCallArguments::test_repaired_arguments_log_debug_with_raw_payload - assert '{a: 1}' in "WARNING google_adk.google.adk.models.lite_llm:lite_llm.py:218 Repaired unquoted JSON object keys in tool call arguments for function 'test_fn'\n"
|
|
Unit Tests (Python 3.11)
Process completed with exit code 1.
|
|
Unit Tests (Python 3.11)
Event loop is closed
|
|
Unit Tests (Python 3.11)
Event loop is closed
|
|
Unit Tests (Python 3.14)
FAILED tests/unittests/models/test_litellm.py::TestParseToolCallArguments::test_literal_eval_without_function_name_logs_debug - assert 0 == 1
|
|
Unit Tests (Python 3.14)
FAILED tests/unittests/models/test_litellm.py::TestParseToolCallArguments::test_literal_eval_layer_logs_debug_not_warning - assert 0 == 1
|
|
Unit Tests (Python 3.14)
FAILED tests/unittests/models/test_litellm.py::TestParseToolCallArguments::test_repaired_arguments_without_function_name - assert '{a: 1}' in 'Repaired unquoted JSON object keys in tool call arguments'
|
|
Unit Tests (Python 3.14)
FAILED tests/unittests/models/test_litellm.py::TestParseToolCallArguments::test_repaired_arguments_log_debug_with_raw_payload - assert '{a: 1}' in "WARNING google_adk.google.adk.models.lite_llm:lite_llm.py:218 Repaired unquoted JSON object keys in tool call arguments for function 'test_fn'\n"
|
|
Unit Tests (Python 3.14)
Process completed with exit code 1.
|
|
Unit Tests (Python 3.14)
Event loop is closed
|
|
Unit Tests (Python 3.14)
Event loop is closed
|
|
A2A v0.3 Tests (Python 3.13)
Failed to save: Unable to reserve cache with key setup-uv-2-x86_64-unknown-linux-gnu-ubuntu-24.04-3.13.16-pruned-30d52e65e3499c92cff0a8bd01381a04ef2f6860b34e50cc06c4db4e77aefaf5, another job may be creating this cache.
|
|
MCP v2 Tests (Python 3.12)
Failed to save: Unable to reserve cache with key setup-uv-2-x86_64-unknown-linux-gnu-ubuntu-24.04-3.12.15-pruned-30d52e65e3499c92cff0a8bd01381a04ef2f6860b34e50cc06c4db4e77aefaf5, another job may be creating this cache.
|
|
MCP v2 Tests (Python 3.14)
Failed to save: Unable to reserve cache with key setup-uv-2-x86_64-unknown-linux-gnu-ubuntu-24.04-3.14.8-pruned-30d52e65e3499c92cff0a8bd01381a04ef2f6860b34e50cc06c4db4e77aefaf5, another job may be creating this cache.
|
|
MCP v2 Tests (Python 3.11)
Failed to save: Unable to reserve cache with key setup-uv-2-x86_64-unknown-linux-gnu-ubuntu-24.04-3.11.17-pruned-30d52e65e3499c92cff0a8bd01381a04ef2f6860b34e50cc06c4db4e77aefaf5, another job may be creating this cache.
|
|
Pre-commit Linter
Node.js 20 is deprecated. The following actions target Node.js 20 but are being forced to run on Node.js 24: actions/cache@v4. For more information see: https://github.blog/changelog/2025-09-19-deprecation-of-node-20-on-github-actions-runners/
|
|
Mypy Check (Python 3.13)
Failed to save: Unable to reserve cache with key setup-uv-2-x86_64-unknown-linux-gnu-ubuntu-24.04-3.13.16-pruned-30d52e65e3499c92cff0a8bd01381a04ef2f6860b34e50cc06c4db4e77aefaf5, another job may be creating this cache.
|
|
Mypy Check (Python 3.11)
Failed to save: Unable to reserve cache with key setup-uv-2-x86_64-unknown-linux-gnu-ubuntu-24.04-3.11.17-pruned-30d52e65e3499c92cff0a8bd01381a04ef2f6860b34e50cc06c4db4e77aefaf5, another job may be creating this cache.
|
|
Mypy Check (Python 3.12)
Failed to save: Unable to reserve cache with key setup-uv-2-x86_64-unknown-linux-gnu-ubuntu-24.04-3.12.15-pruned-30d52e65e3499c92cff0a8bd01381a04ef2f6860b34e50cc06c4db4e77aefaf5, another job may be creating this cache.
|
|
A2A v0.3 Tests (Python 3.12)
"The ubuntu-latest label will migrate to Ubuntu 26 beginning October 19, 2026. For more information, see https://github.com/actions/runner-images/issues/14748"
|
|
MCP v2 Tests (Python 3.13)
"The ubuntu-latest label will migrate to Ubuntu 26 beginning October 19, 2026. For more information, see https://github.com/actions/runner-images/issues/14748"
|
|
A2A v0.3 Tests (Python 3.13)
"The ubuntu-latest label will migrate to Ubuntu 26 beginning October 19, 2026. For more information, see https://github.com/actions/runner-images/issues/14748"
|
|
A2A v0.3 Tests (Python 3.11)
"The ubuntu-latest label will migrate to Ubuntu 26 beginning October 19, 2026. For more information, see https://github.com/actions/runner-images/issues/14748"
|
|
MCP v2 Tests (Python 3.12)
"The ubuntu-latest label will migrate to Ubuntu 26 beginning October 19, 2026. For more information, see https://github.com/actions/runner-images/issues/14748"
|
|
A2A v0.3 Tests (Python 3.14)
"The ubuntu-latest label will migrate to Ubuntu 26 beginning October 19, 2026. For more information, see https://github.com/actions/runner-images/issues/14748"
|
|
MCP v2 Tests (Python 3.14)
"The ubuntu-latest label will migrate to Ubuntu 26 beginning October 19, 2026. For more information, see https://github.com/actions/runner-images/issues/14748"
|
|
MCP v2 Tests (Python 3.11)
"The ubuntu-latest label will migrate to Ubuntu 26 beginning October 19, 2026. For more information, see https://github.com/actions/runner-images/issues/14748"
|
|
Pre-commit Linter
"The ubuntu-latest label will migrate to Ubuntu 26 beginning October 19, 2026. For more information, see https://github.com/actions/runner-images/issues/14748"
|
|
Mypy Check (Python 3.13)
"The ubuntu-latest label will migrate to Ubuntu 26 beginning October 19, 2026. For more information, see https://github.com/actions/runner-images/issues/14748"
|
|
Mypy Check (Python 3.11)
"The ubuntu-latest label will migrate to Ubuntu 26 beginning October 19, 2026. For more information, see https://github.com/actions/runner-images/issues/14748"
|
|
Mypy Check (Python 3.12)
"The ubuntu-latest label will migrate to Ubuntu 26 beginning October 19, 2026. For more information, see https://github.com/actions/runner-images/issues/14748"
|
|
Unit Tests (Python 3.12)
"The ubuntu-latest label will migrate to Ubuntu 26 beginning October 19, 2026. For more information, see https://github.com/actions/runner-images/issues/14748"
|
|
Unit Tests (Python 3.13)
"The ubuntu-latest label will migrate to Ubuntu 26 beginning October 19, 2026. For more information, see https://github.com/actions/runner-images/issues/14748"
|
|
Unit Tests (Python 3.11)
"The ubuntu-latest label will migrate to Ubuntu 26 beginning October 19, 2026. For more information, see https://github.com/actions/runner-images/issues/14748"
|
|
Unit Tests (Python 3.14)
"The ubuntu-latest label will migrate to Ubuntu 26 beginning October 19, 2026. For more information, see https://github.com/actions/runner-images/issues/14748"
|