Skip to content

test(e2e): Add Bun, Deno and Cloudflare variants to react-router-8-framework #59124

test(e2e): Add Bun, Deno and Cloudflare variants to react-router-8-framework

test(e2e): Add Bun, Deno and Cloudflare variants to react-router-8-framework #59124

Triggered via pull request September 25, 2026 15:50
Status Failure
Total duration 17m 9s
Artifacts –

build.yml

on: pull_request
Get CI Metadata  /  Get Metadata
8s
Get CI Metadata / Get Metadata
Check lockfile
3m 26s
Check lockfile
Check file formatting
45s
Check file formatting
Check PR branches
4s
Check PR branches
Build Lambda layer
1m 21s
Build Lambda layer
Matrix: job_bundler_plugin_integration_tests
Matrix: job_cloudflare_integration_tests
Matrix: job_node_integration_tests
Matrix: job_node_unit_tests
Lint
1m 27s
Lint
Circular Dependency Check
1m 46s
Circular Dependency Check
Browser Unit Tests
52s
Browser Unit Tests
Bun Unit Tests
59s
Bun Unit Tests
Deno Unit Tests
1m 14s
Deno Unit Tests
Bun Integration Tests
13m 28s
Bun Integration Tests
Deno Integration Tests
6m 37s
Deno Integration Tests
Check for faulty .d.ts files
55s
Check for faulty .d.ts files
Matrix: job_browser_loader_tests
Matrix: job_browser_playwright_tests
Matrix: job_optional_e2e_tests
Upload Artifacts
0s
Upload Artifacts
Matrix: job_e2e_tests
All required jobs passed or were skipped
4s
All required jobs passed or were skipped
Fit to window
Zoom out
Zoom in

Annotations

33 errors and 324 notices
Cloudflare Integration Tests (1/2)
Process completed with exit code 1.
suites/basic/test.ts > Basic error in fetch handler: dev-packages/cloudflare-integration-tests/runner.ts#L264
AssertionError: expected [ { …(4) }, …(1) ] to deeply equal [ { …(4) }, …(1) ] - Expected + Received @@ -68,10 +68,11 @@ }, ], "version": "11.0.0", }, "timestamp": Any<Number>, + "transaction": "GET /", "user": { "ip_address": "127.0.0.1", }, }, ], ❯ assertEnvelopeMatches runner.ts:264:28 ❯ newEnvelope runner.ts:328:13 ❯ ../test-utils/src/server.ts:19:7 ❯ Layer.handle [as handle_request] ../../node_modules/express/lib/router/layer.js:95:5 ❯ next ../../node_modules/express/lib/router/route.js:149:13 ❯ Route.dispatch ../../node_modules/express/lib/router/route.js:119:3 ❯ Layer.handle [as handle_request] ../../node_modules/express/lib/router/layer.js:95:5 ❯ ../../node_modules/express/lib/router/index.js:284:15 ❯ param ../../node_modules/express/lib/router/index.js:365:14 ❯ param ../../node_modules/express/lib/router/index.js:376:14
E2E react-router-7-framework-static Test
Process completed with exit code 1.
[chromium] β€Ί tests/performance/trace-propagation.test.ts:20:3 β€Ί Trace propagation β€Ί should have trace connection: ../../_temp/test-application/tests/performance/trace-propagation.test.ts#L0
1) [chromium] β€Ί tests/performance/trace-propagation.test.ts:20:3 β€Ί Trace propagation β€Ί should have trace connection Test timeout of 30000ms exceeded.
Cloudflare Integration Tests (2/2)
Process completed with exit code 1.
suites/tracing/headers/test.ts > Tracing headers: dev-packages/cloudflare-integration-tests/runner.ts#L264
AssertionError: expected [ { …(4) }, …(1) ] to deeply equal [ { …(4) }, …(1) ] - Expected + Received @@ -80,10 +80,11 @@ }, ], "version": "11.0.0", }, "timestamp": Any<Number>, + "transaction": "GET /", "user": { "ip_address": "127.0.0.1", }, }, ], ❯ assertEnvelopeMatches runner.ts:264:28 ❯ newEnvelope runner.ts:328:13 ❯ ../test-utils/src/server.ts:19:7 ❯ Layer.handle [as handle_request] ../../node_modules/express/lib/router/layer.js:95:5 ❯ next ../../node_modules/express/lib/router/route.js:149:13 ❯ Route.dispatch ../../node_modules/express/lib/router/route.js:119:3 ❯ Layer.handle [as handle_request] ../../node_modules/express/lib/router/layer.js:95:5 ❯ ../../node_modules/express/lib/router/index.js:284:15 ❯ param ../../node_modules/express/lib/router/index.js:365:14 ❯ param ../../node_modules/express/lib/router/index.js:376:14
suites/tracing/dsc-url-source/test.ts > omits the span name from the DSC for url-source spans when tracing is enabled: dev-packages/cloudflare-integration-tests/suites/tracing/dsc-url-source/test.ts#L5
Error: Test timed out in 60000ms. If this is a long-running test, pass a timeout value as the last argument or configure it globally with "testTimeout". ❯ suites/tracing/dsc-url-source/test.ts:5:1
suites/integrations/http-server/test.ts > Does not capture body for POST without content: dev-packages/cloudflare-integration-tests/runner.ts#L264
AssertionError: expected [ { …(4) }, …(1) ] to deeply equal [ { …(4) }, …(1) ] - Expected + Received @@ -54,10 +54,11 @@ }, ], "version": "11.0.0", }, "timestamp": Any<Number>, + "transaction": "POST /post-no-body", "user": { "ip_address": "127.0.0.1", }, }, ], ❯ assertEnvelopeMatches runner.ts:264:28 ❯ newEnvelope runner.ts:328:13 ❯ ../test-utils/src/server.ts:19:7 ❯ Layer.handle [as handle_request] ../../node_modules/express/lib/router/layer.js:95:5 ❯ next ../../node_modules/express/lib/router/route.js:149:13 ❯ Route.dispatch ../../node_modules/express/lib/router/route.js:119:3 ❯ Layer.handle [as handle_request] ../../node_modules/express/lib/router/layer.js:95:5 ❯ ../../node_modules/express/lib/router/index.js:284:15 ❯ param ../../node_modules/express/lib/router/index.js:365:14 ❯ param ../../node_modules/express/lib/router/index.js:376:14
suites/integrations/http-server/test.ts > Captures plain text request body: dev-packages/cloudflare-integration-tests/runner.ts#L264
AssertionError: expected [ { …(4) }, …(1) ] to deeply equal [ { …(4) }, …(1) ] - Expected + Received @@ -55,10 +55,11 @@ }, ], "version": "11.0.0", }, "timestamp": Any<Number>, + "transaction": "POST /post-text", "user": { "ip_address": "127.0.0.1", }, }, ], ❯ assertEnvelopeMatches runner.ts:264:28 ❯ newEnvelope runner.ts:328:13 ❯ ../test-utils/src/server.ts:19:7 ❯ Layer.handle [as handle_request] ../../node_modules/express/lib/router/layer.js:95:5 ❯ next ../../node_modules/express/lib/router/route.js:149:13 ❯ Route.dispatch ../../node_modules/express/lib/router/route.js:119:3 ❯ Layer.handle [as handle_request] ../../node_modules/express/lib/router/layer.js:95:5 ❯ ../../node_modules/express/lib/router/index.js:284:15 ❯ param ../../node_modules/express/lib/router/index.js:365:14 ❯ param ../../node_modules/express/lib/router/index.js:376:14
suites/integrations/http-server/test.ts > Captures form-urlencoded request body: dev-packages/cloudflare-integration-tests/runner.ts#L264
AssertionError: expected [ { …(4) }, …(1) ] to deeply equal [ { …(4) }, …(1) ] - Expected + Received @@ -55,10 +55,11 @@ }, ], "version": "11.0.0", }, "timestamp": Any<Number>, + "transaction": "POST /post-form", "user": { "ip_address": "127.0.0.1", }, }, ], ❯ assertEnvelopeMatches runner.ts:264:28 ❯ newEnvelope runner.ts:328:13 ❯ ../test-utils/src/server.ts:19:7 ❯ Layer.handle [as handle_request] ../../node_modules/express/lib/router/layer.js:95:5 ❯ next ../../node_modules/express/lib/router/route.js:149:13 ❯ Route.dispatch ../../node_modules/express/lib/router/route.js:119:3 ❯ Layer.handle [as handle_request] ../../node_modules/express/lib/router/layer.js:95:5 ❯ ../../node_modules/express/lib/router/index.js:284:15 ❯ param ../../node_modules/express/lib/router/index.js:365:14 ❯ param ../../node_modules/express/lib/router/index.js:376:14
suites/integrations/http-server/test.ts > Captures JSON request body: dev-packages/cloudflare-integration-tests/runner.ts#L264
AssertionError: expected [ { …(4) }, …(1) ] to deeply equal [ { …(4) }, …(1) ] - Expected + Received @@ -55,10 +55,11 @@ }, ], "version": "11.0.0", }, "timestamp": Any<Number>, + "transaction": "POST /post-json", "user": { "ip_address": "127.0.0.1", }, }, ], ❯ assertEnvelopeMatches runner.ts:264:28 ❯ newEnvelope runner.ts:328:13 ❯ ../test-utils/src/server.ts:19:7 ❯ Layer.handle [as handle_request] ../../node_modules/express/lib/router/layer.js:95:5 ❯ next ../../node_modules/express/lib/router/route.js:149:13 ❯ Route.dispatch ../../node_modules/express/lib/router/route.js:119:3 ❯ Layer.handle [as handle_request] ../../node_modules/express/lib/router/layer.js:95:5 ❯ ../../node_modules/express/lib/router/index.js:284:15 ❯ param ../../node_modules/express/lib/router/index.js:365:14 ❯ param ../../node_modules/express/lib/router/index.js:376:14
suites/double-instrumentation/test.ts > Only sends one error event when withSentry is called twice: dev-packages/cloudflare-integration-tests/runner.ts#L264
AssertionError: expected [ { …(4) }, …(1) ] to deeply equal [ { …(4) }, …(1) ] - Expected + Received @@ -68,10 +68,11 @@ }, ], "version": "11.0.0", }, "timestamp": Any<Number>, + "transaction": "GET /error", "user": { "ip_address": "127.0.0.1", }, }, ], ❯ assertEnvelopeMatches runner.ts:264:28 ❯ newEnvelope runner.ts:328:13 ❯ ../test-utils/src/server.ts:19:7 ❯ Layer.handle [as handle_request] ../../node_modules/express/lib/router/layer.js:95:5 ❯ next ../../node_modules/express/lib/router/route.js:149:13 ❯ Route.dispatch ../../node_modules/express/lib/router/route.js:119:3 ❯ Layer.handle [as handle_request] ../../node_modules/express/lib/router/layer.js:95:5 ❯ ../../node_modules/express/lib/router/index.js:284:15 ❯ param ../../node_modules/express/lib/router/index.js:365:14 ❯ param ../../node_modules/express/lib/router/index.js:376:14
E2E react-router-8-framework (bun) Test (optional)
Process completed with exit code 1.
[chromium] β€Ί tests/performance/trace-propagation.test.ts:21:3 β€Ί Trace propagation β€Ί should have trace connection: ../../_temp/test-application/tests/performance/trace-propagation.test.ts#L50
8) [chromium] β€Ί tests/performance/trace-propagation.test.ts:21:3 β€Ί Trace propagation β€Ί should have trace connection Error: expect(received).toBeDefined() Received: undefined Call Log: - Timeout 10000ms exceeded while waiting on the predicate 48 | const findServerSegmentSpan = () => 49 | streamedSpans.find(span => getSpanOp(span) === 'http.server' && span.is_segment && span.trace_id === traceId); > 50 | await expect.poll(findServerSegmentSpan).toBeDefined(); | ^ 51 | 52 | const requestHandlerSpan = streamedSpans.find(span => span.span_id === handlerSpanId); 53 | expect(requestHandlerSpan).toBeDefined(); at /home/runner/work/_temp/test-application/tests/performance/trace-propagation.test.ts:50:46
[chromium] β€Ί tests/performance/trace-propagation.test.ts:7:3 β€Ί Trace propagation β€Ί should inject metatags in ssr pageload: ../../_temp/test-application/tests/performance/trace-propagation.test.ts#L11
7) [chromium] β€Ί tests/performance/trace-propagation.test.ts:7:3 β€Ί Trace propagation β€Ί should inject metatags in ssr pageload Error: expect(received).toMatch(expected) Expected pattern: /^[a-f0-9]{32}-[a-f0-9]{16}-[01]$/ Received string: "123ad2ee4b814dc581507b0994acaebd-83ba8bd6fd36566f" 9 | const sentryTraceContent = await page.getAttribute('meta[name="sentry-trace"]', 'content'); 10 | expect(sentryTraceContent).toBeDefined(); > 11 | expect(sentryTraceContent).toMatch(/^[a-f0-9]{32}-[a-f0-9]{16}-[01]$/); | ^ 12 | const baggageContent = await page.getAttribute('meta[name="baggage"]', 'content'); 13 | expect(baggageContent).toBeDefined(); 14 | expect(baggageContent).toContain('sentry-environment=qa'); at /home/runner/work/_temp/test-application/tests/performance/trace-propagation.test.ts:11:32
[chromium] β€Ί tests/performance/redis.server.test.ts:6:3 β€Ί server - redis db spans β€Ί server loader emits db.query child spans on the http.server segment: ../../_temp/test-application/tests/performance/redis.server.test.ts#L0
6) [chromium] β€Ί tests/performance/redis.server.test.ts:6:3 β€Ί server - redis db spans β€Ί server loader emits db.query child spans on the http.server segment Test timeout of 30000ms exceeded.
[chromium] β€Ί tests/performance/performance.server.test.ts:39:3 β€Ί server - performance β€Ί should send server span on parameterized route: ../../_temp/test-application/tests/performance/performance.server.test.ts#L0
5) [chromium] β€Ί tests/performance/performance.server.test.ts:39:3 β€Ί server - performance β€Ί should send server span on parameterized route Test timeout of 30000ms exceeded.
[chromium] β€Ί tests/performance/performance.server.test.ts:6:3 β€Ί server - performance β€Ί should send server span on pageload: ../../_temp/test-application/tests/performance/performance.server.test.ts#L0
4) [chromium] β€Ί tests/performance/performance.server.test.ts:6:3 β€Ί server - performance β€Ί should send server span on pageload Test timeout of 30000ms exceeded.
[chromium] β€Ί tests/performance/middleware.server.test.ts:6:3 β€Ί server - middleware β€Ί should send middleware span on pageload: ../../_temp/test-application/tests/performance/middleware.server.test.ts#L0
3) [chromium] β€Ί tests/performance/middleware.server.test.ts:6:3 β€Ί server - middleware β€Ί should send middleware span on pageload Test timeout of 30000ms exceeded.
[chromium] β€Ί tests/errors/errors.server.test.ts:55:3 β€Ί server-side errors β€Ί captures error thrown in server action: ../../_temp/test-application/tests/errors/errors.server.test.ts#L66
2) [chromium] β€Ί tests/errors/errors.server.test.ts:55:3 β€Ί server-side errors β€Ί captures error thrown in server action Error: expect(received).toMatchObject(expected) - Expected - 5 + Received + 0 @@ -18,19 +18,14 @@ }, ], }, "level": "error", "platform": "node", - "request": Object { - "headers": Any<Object>, - "url": StringContaining "errors/server-action", - }, "sdk": Object { "integrations": Any<Array>, "name": "sentry.javascript.react-router", "version": Any<String>, }, "tags": Object { "runtime": "node", }, - "transaction": "POST /errors/server-action.data", } 64 | const error = await errorPromise; 65 | > 66 | expect(error).toMatchObject({ | ^ 67 | exception: { 68 | values: [ 69 | { at /home/runner/work/_temp/test-application/tests/errors/errors.server.test.ts:66:19
[chromium] β€Ί tests/errors/errors.server.test.ts:6:3 β€Ί server-side errors β€Ί captures error thrown in server loader: ../../_temp/test-application/tests/errors/errors.server.test.ts#L16
1) [chromium] β€Ί tests/errors/errors.server.test.ts:6:3 β€Ί server-side errors β€Ί captures error thrown in server loader Error: expect(received).toMatchObject(expected) - Expected - 5 + Received + 0 @@ -18,19 +18,14 @@ }, ], }, "level": "error", "platform": "node", - "request": Object { - "headers": Any<Object>, - "url": StringContaining "errors/server-loader", - }, "sdk": Object { "integrations": Any<Array>, "name": "sentry.javascript.react-router", "version": Any<String>, }, "tags": Object { "runtime": "node", }, - "transaction": "GET /errors/server-loader", } 14 | const error = await errorPromise; 15 | > 16 | expect(error).toMatchObject({ | ^ 17 | exception: { 18 | values: [ 19 | { at /home/runner/work/_temp/test-application/tests/errors/errors.server.test.ts:16:19
Deno Integration Tests
Process completed with exit code 1.
suites/tracing/prisma-orm-v8/test.ts > Prisma ORM v8 Tests > Prisma ORM v8 > with require(esm) bypassing the module hooks > should keep the pg spans on the transaction [cjs]: dev-packages/node-integration-tests/utils/runner/createRunner.ts#L556
Error: Scenario exited (code 1) after 0/1 expected envelope(s), before the test completed. ❯ ChildProcess.<anonymous> utils/runner/createRunner.ts:556:17
suites/tracing/prisma-orm-v8/test.ts > Prisma ORM v8 Tests > Prisma ORM v8 > with require(esm) reaching the module hooks > should instrument Prisma ORM operations and nest their queries [cjs]: dev-packages/node-integration-tests/utils/runner/createRunner.ts#L556
Error: Scenario exited (code 1) after 0/1 expected envelope(s), before the test completed. ❯ ChildProcess.<anonymous> utils/runner/createRunner.ts:556:17
suites/tracing/prisma-orm-v8/test.ts > Prisma ORM v8 Tests > Prisma ORM v8 > should instrument Prisma ORM operations and nest their queries [esm]: dev-packages/node-integration-tests/utils/runner/createRunner.ts#L556
Error: Scenario exited (code 1) after 0/1 expected envelope(s), before the test completed. ❯ ChildProcess.<anonymous> utils/runner/createRunner.ts:556:17
Bun Integration Tests
Process completed with exit code 1.
suites/tracing/prisma-orm-v8/test.ts > Prisma ORM v8 Tests > Prisma ORM v8 > with require(esm) bypassing the module hooks > should keep the pg spans on the transaction [cjs]: dev-packages/node-integration-tests/utils/runner/createEsmAndCjsTests.ts#L385
Error: Test timed out in 75000ms. If this is a long-running test, pass a timeout value as the last argument or configure it globally with "testTimeout". ❯ Object.apply utils/runner/createEsmAndCjsTests.ts:385:22 ❯ suites/tracing/prisma-orm-v8/test.ts:109:11
suites/tracing/prisma-orm-v8/test.ts > Prisma ORM v8 Tests > Prisma ORM v8 > with require(esm) reaching the module hooks > should instrument Prisma ORM operations and nest their queries [cjs]: dev-packages/node-integration-tests/utils/runner/createEsmAndCjsTests.ts#L385
Error: Test timed out in 75000ms. If this is a long-running test, pass a timeout value as the last argument or configure it globally with "testTimeout". ❯ Object.apply utils/runner/createEsmAndCjsTests.ts:385:22 ❯ testInstrumentedOperations suites/tracing/prisma-orm-v8/test.ts:44:11
suites/tracing/prisma-orm-v8/test.ts > Prisma ORM v8 Tests > Prisma ORM v8 > should instrument Prisma ORM operations and nest their queries [esm]: dev-packages/node-integration-tests/utils/runner/createEsmAndCjsTests.ts#L385
Error: Test timed out in 75000ms. If this is a long-running test, pass a timeout value as the last argument or configure it globally with "testTimeout". ❯ Object.apply utils/runner/createEsmAndCjsTests.ts:385:22 ❯ testInstrumentedOperations suites/tracing/prisma-orm-v8/test.ts:44:11 ❯ additionalDependencies.@prisma/orm-postgres suites/tracing/prisma-orm-v8/test.ts:100:11 ❯ createEsmAndCjsTests utils/runner/createEsmAndCjsTests.ts:64:3 ❯ suites/tracing/prisma-orm-v8/test.ts:38:5 ❯ utils/runner/describeWithDockerCompose.ts:65:5
suites/tracing/prisma-orm-v8/test.ts > Prisma ORM v8 Tests > Prisma ORM v8 > with require(esm) bypassing the module hooks > should keep the pg spans on the transaction [cjs]: dev-packages/node-integration-tests/utils/runner/createEsmAndCjsTests.ts#L385
Error: Test timed out in 75000ms. If this is a long-running test, pass a timeout value as the last argument or configure it globally with "testTimeout". ❯ Object.apply utils/runner/createEsmAndCjsTests.ts:385:22 ❯ suites/tracing/prisma-orm-v8/test.ts:109:11
suites/tracing/prisma-orm-v8/test.ts > Prisma ORM v8 Tests > Prisma ORM v8 > with require(esm) reaching the module hooks > should instrument Prisma ORM operations and nest their queries [cjs]: dev-packages/node-integration-tests/utils/runner/createEsmAndCjsTests.ts#L385
Error: Test timed out in 75000ms. If this is a long-running test, pass a timeout value as the last argument or configure it globally with "testTimeout". ❯ Object.apply utils/runner/createEsmAndCjsTests.ts:385:22 ❯ testInstrumentedOperations suites/tracing/prisma-orm-v8/test.ts:44:11
suites/tracing/prisma-orm-v8/test.ts > Prisma ORM v8 Tests > Prisma ORM v8 > should instrument Prisma ORM operations and nest their queries [esm]: dev-packages/node-integration-tests/utils/runner/createEsmAndCjsTests.ts#L385
Error: Test timed out in 75000ms. If this is a long-running test, pass a timeout value as the last argument or configure it globally with "testTimeout". ❯ Object.apply utils/runner/createEsmAndCjsTests.ts:385:22 ❯ testInstrumentedOperations suites/tracing/prisma-orm-v8/test.ts:44:11 ❯ additionalDependencies.@prisma/orm-postgres suites/tracing/prisma-orm-v8/test.ts:100:11 ❯ createEsmAndCjsTests utils/runner/createEsmAndCjsTests.ts:64:3 ❯ suites/tracing/prisma-orm-v8/test.ts:38:5 ❯ utils/runner/describeWithDockerCompose.ts:65:5
All required jobs passed or were skipped
Process completed with exit code 1.
🎭 Playwright Run Summary
2 passed (3.9s)
🎭 Playwright Run Summary
1 passed (6.4s)
🎭 Playwright Run Summary
4 passed (7.3s)
🎭 Playwright Run Summary
5 passed (11.8s)
🎭 Playwright Run Summary
19 passed (13.3s)
🎭 Playwright Run Summary
1 passed (4.7s)
🎭 Playwright Run Summary
1 passed (2.9s)
🎭 Playwright Run Summary
10 passed (10.2s)
🎭 Playwright Run Summary
4 passed (5.5s)
🎭 Playwright Run Summary
12 passed (11.3s)
🎭 Playwright Run Summary
11 passed (9.6s)
🎭 Playwright Run Summary
16 passed (10.6s)
🎭 Playwright Run Summary
3 skipped 17 passed (8.0s)
🎭 Playwright Run Summary
11 skipped 2 passed (3.8s)
🎭 Playwright Run Summary
7 passed (8.0s)
🎭 Playwright Run Summary
12 passed (11.5s)
🎭 Playwright Run Summary
7 passed (3.3s)
🎭 Playwright Run Summary
7 passed (5.2s)
🎭 Playwright Run Summary
1 skipped 19 passed (1.6s)
🎭 Playwright Run Summary
4 passed (4.4s)
🎭 Playwright Run Summary
4 passed (10.3s)
🎭 Playwright Run Summary
10 passed (4.2s)
🎭 Playwright Run Summary
10 passed (4.5s)
🎭 Playwright Run Summary
1 skipped 73 passed (15.5s)
🎭 Playwright Run Summary
3 passed (7.0s)
🎭 Playwright Run Summary
8 passed (10.5s)
🎭 Playwright Run Summary
11 passed (11.4s)
🎭 Playwright Run Summary
5 passed (9.0s)
🎭 Playwright Run Summary
1 passed (3.2s)
🎭 Playwright Run Summary
1 passed (3.2s)
🎭 Playwright Run Summary
8 skipped 6 passed (12.3s)
🎭 Playwright Run Summary
10 passed (12.9s)
🎭 Playwright Run Summary
2 passed (16.1s)
🎭 Playwright Run Summary
5 passed (14.0s)
🎭 Playwright Run Summary
4 passed (6.0s)
🎭 Playwright Run Summary
9 passed (13.0s)
🎭 Playwright Run Summary
3 passed (5.7s)
🎭 Playwright Run Summary
4 passed (7.0s)
🎭 Playwright Run Summary
7 passed (18.3s)
🎭 Playwright Run Summary
4 passed (3.5s)
🎭 Playwright Run Summary
22 passed (12.0s)
🎭 Playwright Run Summary
25 passed (22.6s)
🎭 Playwright Run Summary
11 passed (7.2s)
🎭 Playwright Run Summary
10 passed (14.4s)
🎭 Playwright Run Summary
8 passed (5.6s)
🎭 Playwright Run Summary
1 passed (5.6s)
🎭 Playwright Run Summary
1 passed (6.0s)
🎭 Playwright Run Summary
10 passed (19.0s)
🎭 Playwright Run Summary
30 passed (32.9s)
🎭 Playwright Run Summary
11 passed (11.4s)
🎭 Playwright Run Summary
2 passed (4.7s)
🎭 Playwright Run Summary
9 passed (14.5s)
🎭 Playwright Run Summary
10 passed (32.3s)
🎭 Playwright Run Summary
1 skipped 73 passed (14.4s)
🎭 Playwright Run Summary
12 passed (8.4s)
🎭 Playwright Run Summary
16 passed (10.6s)
🎭 Playwright Run Summary
1 passed (3.0s)
🎭 Playwright Run Summary
1 passed (3.9s)
🎭 Playwright Run Summary
5 passed (7.0s)
🎭 Playwright Run Summary
4 passed (13.0s)
🎭 Playwright Run Summary
5 passed (6.0s)
🎭 Playwright Run Summary
3 passed (3.4s)
🎭 Playwright Run Summary
1 passed (18.9s)
🎭 Playwright Run Summary
30 passed (32.4s)
🎭 Playwright Run Summary
23 passed (14.2s)
🎭 Playwright Run Summary
16 passed (20.3s)
🎭 Playwright Run Summary
3 passed (5.3s)
🎭 Playwright Run Summary
1 skipped 19 passed (8.8s)
🎭 Playwright Run Summary
11 passed (20.0s)
🎭 Playwright Run Summary
8 passed (11.7s)
🎭 Playwright Run Summary
3 passed (12.9s)
🎭 Playwright Run Summary
3 passed (10.2s)
🎭 Playwright Run Summary
7 passed (11.2s)
🎭 Playwright Run Summary
23 passed (18.4s)
🎭 Playwright Run Summary
21 skipped 3 passed (3.8s)
🎭 Playwright Run Summary
11 passed (19.9s)
🎭 Playwright Run Summary
10 passed (19.4s)
🎭 Playwright Run Summary
2 passed (35.3s)
🎭 Playwright Run Summary
2 passed (4.0s)
🎭 Playwright Run Summary
2 passed (4.1s)
🎭 Playwright Run Summary
10 passed (31.0s)
🎭 Playwright Run Summary
3 passed (16.6s)
🎭 Playwright Run Summary
3 passed (12.9s)
🎭 Playwright Run Summary
12 passed (17.1s)
🎭 Playwright Run Summary
12 passed (17.2s)
🎭 Playwright Run Summary
6 passed (14.9s)
🎭 Playwright Run Summary
1 skipped 12 passed (29.1s)
🎭 Playwright Run Summary
5 passed (11.5s)
🎭 Playwright Run Summary
14 passed (33.0s)
🎭 Playwright Run Summary
11 passed (9.5s)
🎭 Playwright Run Summary
6 passed (14.9s)
🎭 Playwright Run Summary
15 passed (8.8s)
🎭 Playwright Run Summary
2 passed (3.6s)
🎭 Playwright Run Summary
5 passed (12.7s)
🎭 Playwright Run Summary
16 passed (20.4s)
🎭 Playwright Run Summary
12 passed (33.9s)
🎭 Playwright Run Summary
4 passed (3.3s)
🎭 Playwright Run Summary
8 passed (8.5s)
🎭 Playwright Run Summary
2 passed (5.1s)
🎭 Playwright Run Summary
13 passed (30.5s)
🎭 Playwright Run Summary
53 passed (37.6s)
🎭 Playwright Run Summary
4 passed (9.6s)
🎭 Playwright Run Summary
5 passed (15.6s)
🎭 Playwright Run Summary
5 passed (12.1s)
🎭 Playwright Run Summary
14 passed (42.7s)
🎭 Playwright Run Summary
1 passed (4.1s)
🎭 Playwright Run Summary
6 passed (36.0s)
🎭 Playwright Run Summary
9 passed (11.1s)
🎭 Playwright Run Summary
10 passed (40.9s)
🎭 Playwright Run Summary
1 skipped 16 passed (32.4s)
🎭 Playwright Run Summary
12 passed (40.9s)
🎭 Playwright Run Summary
17 passed (30.2s)
🎭 Playwright Run Summary
4 passed (2.8s)
🎭 Playwright Run Summary
2 skipped 14 passed (16.9s)
🎭 Playwright Run Summary
3 passed (3.2s)
🎭 Playwright Run Summary
11 passed (38.4s)
🎭 Playwright Run Summary
4 passed (11.8s)
🎭 Playwright Run Summary
3 passed (21.4s)
🎭 Playwright Run Summary
3 passed (13.6s)
🎭 Playwright Run Summary
11 passed (9.5s)
🎭 Playwright Run Summary
3 passed (7.0s)
🎭 Playwright Run Summary
22 skipped 2 passed (5.8s)
🎭 Playwright Run Summary
11 passed (20.4s)
🎭 Playwright Run Summary
5 passed (12.1s)
🎭 Playwright Run Summary
5 passed (12.0s)
🎭 Playwright Run Summary
4 passed (12.7s)
🎭 Playwright Run Summary
2 passed (32.4s)
🎭 Playwright Run Summary
12 passed (40.7s)
🎭 Playwright Run Summary
10 passed (12.9s)
🎭 Playwright Run Summary
22 passed (49.5s)
🎭 Playwright Run Summary
1 skipped 73 passed (13.7s)
🎭 Playwright Run Summary
1 skipped 73 passed (14.7s)
🎭 Playwright Run Summary
9 passed (3.1s)
🎭 Playwright Run Summary
9 passed (3.4s)
🎭 Playwright Run Summary
6 passed (14.8s)
🎭 Playwright Run Summary
9 passed (17.4s)
🎭 Playwright Run Summary
22 passed (45.7s)
🎭 Playwright Run Summary
2 skipped 10 passed (6.1s)
🎭 Playwright Run Summary
2 skipped 10 passed (6.6s)
🎭 Playwright Run Summary
9 passed (37.6s)
🎭 Playwright Run Summary
2 passed (26.7s)
🎭 Playwright Run Summary
14 passed (43.6s)
🎭 Playwright Run Summary
13 passed (35.1s)
🎭 Playwright Run Summary
3 passed (31.3s)
🎭 Playwright Run Summary
4 passed (8.8s)
🎭 Playwright Run Summary
14 passed (43.6s)
🎭 Playwright Run Summary
5 passed (9.7s)
🎭 Playwright Run Summary
22 passed (45.3s)
🎭 Playwright Run Summary
4 skipped 10 passed (18.8s)
🎭 Playwright Run Summary
12 passed (36.7s)
🎭 Playwright Run Summary
2 passed (30.1s)
🎭 Playwright Run Summary
22 skipped 2 passed (4.8s)
🎭 Playwright Run Summary
15 passed (20.8s)
🎭 Playwright Run Summary
22 passed (46.4s)
🎭 Playwright Run Summary
13 passed (47.2s)
🎭 Playwright Run Summary
15 passed (1.2m)
🎭 Playwright Run Summary
10 passed (26.5s)
🎭 Playwright Run Summary
10 passed (6.5s)
🎭 Playwright Run Summary
3 skipped 15 passed (29.6s)
🎭 Playwright Run Summary
18 passed (15.9s)
🎭 Playwright Run Summary
2 passed (18.0s)
🎭 Playwright Run Summary
13 passed (35.4s)
🎭 Playwright Run Summary
4 passed (12.5s)
🎭 Playwright Run Summary
12 passed (21.9s)
🎭 Playwright Run Summary
1 failed [chromium] β€Ί tests/performance/trace-propagation.test.ts:20:3 β€Ί Trace propagation β€Ί should have trace connection 21 passed (1.1m)
🎭 Playwright Run Summary
22 skipped 2 passed (5.1s)
🎭 Playwright Run Summary
2 skipped 7 passed (33.8s)
🎭 Playwright Run Summary
25 passed (53.3s)
🎭 Playwright Run Summary
2 passed (15.3s)
🎭 Playwright Run Summary
13 passed (36.3s)
🎭 Playwright Run Summary
3 passed (16.4s)
🎭 Playwright Run Summary
3 passed (9.7s)
🎭 Playwright Run Summary
25 passed (1.0m)
🎭 Playwright Run Summary
10 passed (22.2s)
🎭 Playwright Run Summary
10 passed (13.3s)
🎭 Playwright Run Summary
40 passed (35.0s)
🎭 Playwright Run Summary
13 passed (43.0s)
🎭 Playwright Run Summary
14 passed (44.1s)
🎭 Playwright Run Summary
22 passed (50.1s)
🎭 Playwright Run Summary
9 passed (12.4s)
🎭 Playwright Run Summary
14 passed (42.1s)
🎭 Playwright Run Summary
23 passed (21.9s)
🎭 Playwright Run Summary
4 passed (4.7s)
🎭 Playwright Run Summary
22 passed (49.7s)
🎭 Playwright Run Summary
12 passed (40.8s)
🎭 Playwright Run Summary
4 passed (17.6s)
🎭 Playwright Run Summary
4 passed (9.6s)
🎭 Playwright Run Summary
4 passed (38.6s)
🎭 Playwright Run Summary
9 passed (12.2s)
🎭 Playwright Run Summary
5 passed (34.8s)
🎭 Playwright Run Summary
5 passed (34.5s)
🎭 Playwright Run Summary
4 passed (22.2s)
🎭 Playwright Run Summary
4 passed (11.7s)
🎭 Playwright Run Summary
12 passed (41.0s)
🎭 Playwright Run Summary
16 skipped 12 passed (31.8s)
🎭 Playwright Run Summary
3 passed (19.1s)
🎭 Playwright Run Summary
3 passed (13.0s)
🎭 Playwright Run Summary
9 passed (12.3s)
🎭 Playwright Run Summary
17 passed (1.1m)
🎭 Playwright Run Summary
3 passed (38.5s)
🎭 Playwright Run Summary
3 passed (13.6s)
🎭 Playwright Run Summary
13 passed (41.6s)
🎭 Playwright Run Summary
13 passed (13.6s)
🎭 Playwright Run Summary
2 passed (18.7s)
🎭 Playwright Run Summary
15 passed (58.9s)
🎭 Playwright Run Summary
2 passed (20.7s)
🎭 Playwright Run Summary
15 passed (49.6s)
🎭 Playwright Run Summary
4 skipped 12 passed (35.2s)
🎭 Playwright Run Summary
2 skipped 14 passed (15.8s)
🎭 Playwright Run Summary
4 passed (30.9s)
🎭 Playwright Run Summary
4 passed (8.9s)
🎭 Playwright Run Summary
2 passed (17.2s)
🎭 Playwright Run Summary
18 passed (1.1m)
🎭 Playwright Run Summary
3 passed (40.5s)
🎭 Playwright Run Summary
3 passed (8.0s)
🎭 Playwright Run Summary
9 passed (33.6s)
🎭 Playwright Run Summary
2 passed (16.7s)
🎭 Playwright Run Summary
18 passed (52.7s)
🎭 Playwright Run Summary
5 skipped 25 passed (12.3s)
🎭 Playwright Run Summary
6 passed (45.3s)
🎭 Playwright Run Summary
6 skipped 7 passed (39.7s)
🎭 Playwright Run Summary
13 passed (17.0s)
🎭 Playwright Run Summary
5 passed (35.2s)
🎭 Playwright Run Summary
5 passed (35.0s)
🎭 Playwright Run Summary
7 skipped 23 passed (11.1s)
🎭 Playwright Run Summary
13 passed (43.0s)
🎭 Playwright Run Summary
4 skipped 26 passed (16.5s)
🎭 Playwright Run Summary
13 passed (42.9s)
🎭 Playwright Run Summary
13 passed (14.8s)
🎭 Playwright Run Summary
4 skipped 12 passed (25.9s)
🎭 Playwright Run Summary
2 skipped 14 passed (14.5s)
🎭 Playwright Run Summary
4 passed (14.8s)
🎭 Playwright Run Summary
4 skipped 51 passed (1.2m)
🎭 Playwright Run Summary
15 passed (29.4s)
🎭 Playwright Run Summary
10 passed (43.0s)
🎭 Playwright Run Summary
40 passed (38.9s)
🎭 Playwright Run Summary
11 passed (39.1s)
🎭 Playwright Run Summary
7 skipped 23 passed (11.1s)
🎭 Playwright Run Summary
5 passed (44.1s)
🎭 Playwright Run Summary
5 passed (14.4s)
🎭 Playwright Run Summary
2 passed (21.4s)
🎭 Playwright Run Summary
3 skipped 21 passed (46.8s)
🎭 Playwright Run Summary
5 skipped 25 passed (17.6s)
🎭 Playwright Run Summary
2 skipped 13 passed (35.8s)
🎭 Playwright Run Summary
15 passed (23.6s)
🎭 Playwright Run Summary
17 passed (1.0m)
🎭 Playwright Run Summary
3 passed (26.8s)
🎭 Playwright Run Summary
3 passed (5.6s)
🎭 Playwright Run Summary
8 skipped 22 passed (11.3s)
🎭 Playwright Run Summary
10 passed (55.0s)
🎭 Playwright Run Summary
2 passed (19.7s)
🎭 Playwright Run Summary
11 passed (44.3s)
🎭 Playwright Run Summary
1 skipped 29 passed (20.3s)
🎭 Playwright Run Summary
16 skipped 12 passed (27.9s)
🎭 Playwright Run Summary
3 skipped 15 passed (1.1m)
🎭 Playwright Run Summary
18 passed (16.1s)
🎭 Playwright Run Summary
13 passed (55.0s)
🎭 Playwright Run Summary
13 passed (16.5s)
🎭 Playwright Run Summary
6 skipped 7 passed (36.3s)
🎭 Playwright Run Summary
13 passed (21.0s)
🎭 Playwright Run Summary
4 skipped 30 passed (57.9s)
🎭 Playwright Run Summary
2 skipped 32 passed (1.2m)
🎭 Playwright Run Summary
2 passed (26.3s)
🎭 Playwright Run Summary
2 skipped 21 passed (1.1m)
🎭 Playwright Run Summary
5 skipped 30 passed (1.4m)
🎭 Playwright Run Summary
5 skipped 30 passed (50.1s)
🎭 Playwright Run Summary
1 skipped 5 passed (23.7s)
🎭 Playwright Run Summary
58 passed (1.7m)
🎭 Playwright Run Summary
1 skipped 5 passed (24.6s)
🎭 Playwright Run Summary
58 passed (1.7m)
🎭 Playwright Run Summary
2 skipped 13 passed (1.3m)
🎭 Playwright Run Summary
15 passed (22.2s)
🎭 Playwright Run Summary
486 skipped 198 passed (25.5s)
🎭 Playwright Run Summary
44 passed (2.6m)
🎭 Playwright Run Summary
1 skipped 5 passed (29.2s)
🎭 Playwright Run Summary
58 passed (1.7m)
🎭 Playwright Run Summary
8 failed [chromium] β€Ί tests/errors/errors.server.test.ts:6:3 β€Ί server-side errors β€Ί captures error thrown in server loader [chromium] β€Ί tests/errors/errors.server.test.ts:55:3 β€Ί server-side errors β€Ί captures error thrown in server action [chromium] β€Ί tests/performance/middleware.server.test.ts:6:3 β€Ί server - middleware β€Ί should send middleware span on pageload [chromium] β€Ί tests/performance/performance.server.test.ts:6:3 β€Ί server - performance β€Ί should send server span on pageload [chromium] β€Ί tests/performance/performance.server.test.ts:39:3 β€Ί server - performance β€Ί should send server span on parameterized route [chromium] β€Ί tests/performance/redis.server.test.ts:6:3 β€Ί server - redis db spans β€Ί server loader emits db.query child spans on the http.server segment [chromium] β€Ί tests/performance/trace-propagation.test.ts:7:3 β€Ί Trace propagation β€Ί should inject metatags in ssr pageload [chromium] β€Ί tests/performance/trace-propagation.test.ts:21:3 β€Ί Trace propagation β€Ί should have trace connection 14 passed (3.0m)
🎭 Playwright Run Summary
489 skipped 195 passed (31.4s)
🎭 Playwright Run Summary
4 passed (17.8s)
🎭 Playwright Run Summary
67 passed (2.2m)
🎭 Playwright Run Summary
14 passed (14.9s)
🎭 Playwright Run Summary
1 skipped 5 passed (26.4s)
🎭 Playwright Run Summary
67 passed (2.2m)
🎭 Playwright Run Summary
1 skipped 5 passed (30.9s)
🎭 Playwright Run Summary
67 passed (2.2m)
🎭 Playwright Run Summary
491 skipped 193 passed (31.4s)
🎭 Playwright Run Summary
1 skipped 5 passed (31.0s)
🎭 Playwright Run Summary
67 passed (2.2m)
🎭 Playwright Run Summary
355 skipped 329 passed (53.3s)
🎭 Playwright Run Summary
5 skipped 30 passed (2.2m)
🎭 Playwright Run Summary
4 skipped 31 passed (50.1s)
🎭 Playwright Run Summary
354 skipped 330 passed (56.0s)
🎭 Playwright Run Summary
15 skipped 32 passed (1.7m)
🎭 Playwright Run Summary
5 skipped 42 passed (1.4m)
🎭 Playwright Run Summary
16 skipped 32 passed (1.8m)
🎭 Playwright Run Summary
5 skipped 43 passed (1.5m)
🎭 Playwright Run Summary
1 skipped 170 passed (1.6m)
🎭 Playwright Run Summary
5 skipped 30 passed (2.3m)
🎭 Playwright Run Summary
4 skipped 31 passed (50.5s)
🎭 Playwright Run Summary
4 skipped 167 passed (1.6m)
🎭 Playwright Run Summary
16 skipped 32 passed (1.8m)
🎭 Playwright Run Summary
5 skipped 43 passed (1.6m)
🎭 Playwright Run Summary
16 skipped 32 passed (2.1m)
🎭 Playwright Run Summary
5 skipped 43 passed (1.5m)
🎭 Playwright Run Summary
193 skipped 491 passed (1.8m)
🎭 Playwright Run Summary
197 skipped 487 passed (1.7m)
🎭 Playwright Run Summary
5 skipped 166 passed (2.0m)
🎭 Playwright Run Summary
60 skipped 624 passed (2.2m)
🎭 Playwright Run Summary
56 skipped 628 passed (2.4m)
🎭 Playwright Run Summary
56 skipped 628 passed (2.2m)
🎭 Playwright Run Summary
4 skipped 167 passed (2.1m)
🎭 Playwright Run Summary
58 skipped 626 passed (2.2m)
🎭 Playwright Run Summary
2 skipped 32 passed (2.5m)
🎭 Playwright Run Summary
2 skipped 32 passed (1.3m)
🎭 Playwright Run Summary
60 skipped 624 passed (2.2m)
🎭 Playwright Run Summary
187 skipped 497 passed (2.3m)
🎭 Playwright Run Summary
13 skipped 35 passed (3.0m)
🎭 Playwright Run Summary
5 skipped 43 passed (1.5m)
🎭 Playwright Run Summary
13 skipped 35 passed (3.0m)
🎭 Playwright Run Summary
5 skipped 43 passed (1.5m)
🎭 Playwright Run Summary
2 skipped 32 passed (3.2m)
🎭 Playwright Run Summary
2 skipped 32 passed (1.3m)
🎭 Playwright Run Summary
13 skipped 35 passed (3.0m)
🎭 Playwright Run Summary
5 skipped 43 passed (1.5m)