Skip to content

test(e2e): Move react-router-8-cloudflare MySQL tests into react-router-8-framework #58920

test(e2e): Move react-router-8-cloudflare MySQL tests into react-router-8-framework

test(e2e): Move react-router-8-cloudflare MySQL tests into react-router-8-framework #58920

Triggered via pull request September 24, 2026 14:21
Status Failure
Total duration 18m 31s
Artifacts 6

build.yml

on: pull_request
Get CI Metadata  /  Get Metadata
7s
Get CI Metadata / Get Metadata
Check lockfile
3m 27s
Check lockfile
Check file formatting
54s
Check file formatting
Check PR branches
5s
Check PR branches
Build Lambda layer
1m 15s
Build Lambda layer
Matrix: job_bundler_plugin_integration_tests
Matrix: job_node_integration_tests
Matrix: job_node_unit_tests
Lint
1m 47s
Lint
Circular Dependency Check
1m 25s
Circular Dependency Check
Browser Unit Tests
2m 24s
Browser Unit Tests
Bun Unit Tests
45s
Bun Unit Tests
Deno Unit Tests
1m 14s
Deno Unit Tests
Cloudflare Integration Tests
7m 44s
Cloudflare Integration Tests
Bun Integration Tests
6m 8s
Bun Integration Tests
Deno Integration Tests
7m 4s
Deno Integration Tests
Check for faulty .d.ts files
48s
Check for faulty .d.ts files
Matrix: job_browser_loader_tests
Matrix: job_browser_playwright_tests
Matrix: job_optional_e2e_tests
Upload Artifacts
Upload Artifacts
Matrix: job_e2e_tests
All required jobs passed or were skipped
3s
All required jobs passed or were skipped
Fit to window
Zoom out
Zoom in

Annotations

27 errors and 321 notices
E2E cloudflare-workers-static Test
Process completed with exit code 1.
[chromium] › tests/index.test.ts:42:5 › Websocket.webSocketMessage: ../../_temp/test-application/tests/index.test.ts#L53
1) [chromium] › tests/index.test.ts:42:5 › Websocket.webSocketMessage ──────────────────────────── Error: WebSocket was closed before the connection was established 51 | }); 52 | const event = await eventWaiter; > 53 | socket.close(); | ^ 54 | expect(event.exception?.values?.[0]?.value).toBe('Should be recorded in Sentry: webSocketMessage'); 55 | expect(event.exception?.values?.[0]?.mechanism?.type).toBe('auto.faas.cloudflare.durable_object'); 56 | }); at WebSocket.close (/home/runner/work/_temp/test-application/node_modules/.pnpm/ws@8.21.3/node_modules/ws/lib/websocket.js:306:7) at /home/runner/work/_temp/test-application/tests/index.test.ts:53:10
[chromium] › tests/index.test.ts:42:5 › Websocket.webSocketMessage: ../../_temp/test-application/tests/index.test.ts#L54
1) [chromium] › tests/index.test.ts:42:5 › Websocket.webSocketMessage ──────────────────────────── Error: expect(received).toBe(expected) // Object.is equality Expected: "Should be recorded in Sentry: webSocketMessage" Received: "Should be recorded in Sentry." 52 | const event = await eventWaiter; 53 | socket.close(); > 54 | expect(event.exception?.values?.[0]?.value).toBe('Should be recorded in Sentry: webSocketMessage'); | ^ 55 | expect(event.exception?.values?.[0]?.mechanism?.type).toBe('auto.faas.cloudflare.durable_object'); 56 | }); 57 | at /home/runner/work/_temp/test-application/tests/index.test.ts:54:47
Deno Integration Tests
Process completed with exit code 1.
suites/tracing/postgresjs/test.ts > postgresjs auto instrumentation > url initialization > should instrument postgres package with URL initialization [cjs]: dev-packages/node-integration-tests/utils/runner/createRunner.ts#L445
Error: Expected envelope item type 'transaction' but got 'event'. Item: [{"type":"event"},{"exception":{"values":[{"type":"PostgresError","value":"relation \"User\" does not exist","stacktrace":{"frames":[{"filename":"/home/runner/work/sentry-javascript/sentry-javascript/dev-packages/node-integration-tests/suites/tracing/postgresjs/tmp_mufmmcnv_1gvp7t/scenario-url.cjs","module":"scenario-url","function":"?","lineno":65,"colno":18,"in_app":true,"pre_context":[" await sql`"," DROP TABLE \"User\";"," `;",""," // This will be captured as an error as the table no longer exists"],"context_line":" await sql`","post_context":[" SELECT * FROM \"User\" WHERE \"email\" = ${email};"," `;"," } finally {"," await sql.end();"," }"]},{"filename":"/home/runner/work/sentry-javascript/sentry-javascript/node_modules/postgres/cjs/src/index.js","module":"postgres.cjs.src:index","function":"sql","lineno":112,"colno":11,"in_app":false,"pre_context":[" return new Parameter(value, type)"," }",""," function sql(strings, ...args) {"," const query = strings && Array.isArray(strings.raw)"],"context_line":" ? new Query(strings, args, handler, cancel)","post_context":[" : typeof strings === 'string' && !args.length"," ? new Identifier(options.transform.column.to ? options.transform.column.to(strings) : strings)"," : new Builder(strings, args)"," return query"," }"]},{"filename":"/home/runner/work/sentry-javascript/sentry-javascript/node_modules/postgres/cjs/src/query.js","module":"postgres.cjs.src:query","function":"new Query","lineno":28,"colno":75,"in_app":false,"pre_context":[" this.state = null"," this.statement = null",""," this.resolve = x => (this.active = false, resolve(x))"," this.reject = x => (this.active = false, reject(x))"],"context_line":"","post_context":[" this.active = false"," this.cancelled = null"," this.executed = false"," this.signature = ''",""]},{"filename":"/home/runner/work/sentry-javascript/sentry-javascript/node_modules/postgres/cjs/src/query.js","module":"postgres.cjs.src:query","function":"cachedError","lineno":193,"colno":23,"in_app":false},{"filename":"ext:deno_node/internal/stream_base_commons.ts","module":"stream_base_commons.ts","function":"TCPWrap.onStreamRead [as onread]","lineno":200,"colno":25,"in_app":false},{"filename":"ext:deno_node/internal/streams/readable.js","module":"readable","function":"Socket.Readable.push","lineno":424,"colno":7,"in_app":false},{"filename":"ext:deno_node/internal/streams/readable.js","module":"readable","function":"readableAddChunkPushByteMode","lineno":555,"colno":3,"in_app":false},{"filename":"ext:deno_node/internal/streams/readable.js","module":"readable","function":"addChunk","lineno":607,"colno":12,"in_app":false},{"filename":"ext:deno_node/_events.mjs","module":"_events","function":"Socket.emit","lineno":450,"colno":20,"in_app":false},{"filename":"/home/runner/work/sentry-javascript/sentry-javascript/node_modules/postgres/cjs/src/connection.js","module":"postgres.cjs.src:connection","function":"Socket.data","lineno":242,"colno":13,"in_app":false,"pre_context":[""," typeof options.debug === 'function' && options.debug(id, string, parameters, types)"," }",""," function write(x, fn) {"],"context_line":" chunk = chunk ? Buffer.concat([chunk, x]) : Buffer.from(x)","post_context":[" if (fn || chunk.length >= 1024)"," return nextWrite(fn)"," nextWriteTimer === null && (nextWriteTimer = setImmediate(nextWrite))"," return true"," }"]},{"filename":"/home/runner/work/sentry-javascript/sentry-javascript/node_modules/postgres/cjs/src/connection.js","module":"postgres.cjs.src:connection","function":"handle","lineno":356,"colno":707,"in_app":false,"pre_context":[""," function reconnect() {"," setTimeout(connect, closedDate ? closedDate + delay - performance.now() : 0)"," }",""],"context_line":" function connected() {","post_context":[" try {"," statements = {}"," needsTypes = options.fetch_types","
E2E react-router-7-framework-static Test
Process completed with exit code 1.
[chromium] › tests/performance/trace-propagation.test.ts:20:3 › Trace propagation › should have trace connection: ../../_temp/test-application/tests/performance/trace-propagation.test.ts#L0
1) [chromium] › tests/performance/trace-propagation.test.ts:20:3 › Trace propagation › should have trace connection Test timeout of 30000ms exceeded.
Cloudflare Integration Tests
Process completed with exit code 1.
suites/tracing/headers/test.ts > Tracing headers: dev-packages/cloudflare-integration-tests/runner.ts#L264
AssertionError: expected [ { …(4) }, …(1) ] to deeply equal [ { …(4) }, …(1) ] - Expected + Received @@ -80,10 +80,11 @@ }, ], "version": "11.0.0", }, "timestamp": Any<Number>, + "transaction": "GET /", "user": { "ip_address": "127.0.0.1", }, }, ], ❯ assertEnvelopeMatches runner.ts:264:28 ❯ newEnvelope runner.ts:328:13 ❯ ../test-utils/src/server.ts:19:7 ❯ Layer.handle [as handle_request] ../../node_modules/express/lib/router/layer.js:95:5 ❯ next ../../node_modules/express/lib/router/route.js:149:13 ❯ Route.dispatch ../../node_modules/express/lib/router/route.js:119:3 ❯ Layer.handle [as handle_request] ../../node_modules/express/lib/router/layer.js:95:5 ❯ ../../node_modules/express/lib/router/index.js:284:15 ❯ param ../../node_modules/express/lib/router/index.js:365:14 ❯ param ../../node_modules/express/lib/router/index.js:376:14
suites/tracing/dsc-url-source/test.ts > omits the span name from the DSC for url-source spans when tracing is enabled: dev-packages/cloudflare-integration-tests/suites/tracing/dsc-url-source/test.ts#L5
Error: Test timed out in 60000ms. If this is a long-running test, pass a timeout value as the last argument or configure it globally with "testTimeout". ❯ suites/tracing/dsc-url-source/test.ts:5:1
suites/integrations/http-server/test.ts > Does not capture body for POST without content: dev-packages/cloudflare-integration-tests/runner.ts#L264
AssertionError: expected [ { …(4) }, …(1) ] to deeply equal [ { …(4) }, …(1) ] - Expected + Received @@ -54,10 +54,11 @@ }, ], "version": "11.0.0", }, "timestamp": Any<Number>, + "transaction": "POST /post-no-body", "user": { "ip_address": "127.0.0.1", }, }, ], ❯ assertEnvelopeMatches runner.ts:264:28 ❯ newEnvelope runner.ts:328:13 ❯ ../test-utils/src/server.ts:19:7 ❯ Layer.handle [as handle_request] ../../node_modules/express/lib/router/layer.js:95:5 ❯ next ../../node_modules/express/lib/router/route.js:149:13 ❯ Route.dispatch ../../node_modules/express/lib/router/route.js:119:3 ❯ Layer.handle [as handle_request] ../../node_modules/express/lib/router/layer.js:95:5 ❯ ../../node_modules/express/lib/router/index.js:284:15 ❯ param ../../node_modules/express/lib/router/index.js:365:14 ❯ param ../../node_modules/express/lib/router/index.js:376:14
suites/integrations/http-server/test.ts > Captures plain text request body: dev-packages/cloudflare-integration-tests/runner.ts#L264
AssertionError: expected [ { …(4) }, …(1) ] to deeply equal [ { …(4) }, …(1) ] - Expected + Received @@ -55,10 +55,11 @@ }, ], "version": "11.0.0", }, "timestamp": Any<Number>, + "transaction": "POST /post-text", "user": { "ip_address": "127.0.0.1", }, }, ], ❯ assertEnvelopeMatches runner.ts:264:28 ❯ newEnvelope runner.ts:328:13 ❯ ../test-utils/src/server.ts:19:7 ❯ Layer.handle [as handle_request] ../../node_modules/express/lib/router/layer.js:95:5 ❯ next ../../node_modules/express/lib/router/route.js:149:13 ❯ Route.dispatch ../../node_modules/express/lib/router/route.js:119:3 ❯ Layer.handle [as handle_request] ../../node_modules/express/lib/router/layer.js:95:5 ❯ ../../node_modules/express/lib/router/index.js:284:15 ❯ param ../../node_modules/express/lib/router/index.js:365:14 ❯ param ../../node_modules/express/lib/router/index.js:376:14
suites/integrations/http-server/test.ts > Captures form-urlencoded request body: dev-packages/cloudflare-integration-tests/runner.ts#L264
AssertionError: expected [ { …(4) }, …(1) ] to deeply equal [ { …(4) }, …(1) ] - Expected + Received @@ -55,10 +55,11 @@ }, ], "version": "11.0.0", }, "timestamp": Any<Number>, + "transaction": "POST /post-form", "user": { "ip_address": "127.0.0.1", }, }, ], ❯ assertEnvelopeMatches runner.ts:264:28 ❯ newEnvelope runner.ts:328:13 ❯ ../test-utils/src/server.ts:19:7 ❯ Layer.handle [as handle_request] ../../node_modules/express/lib/router/layer.js:95:5 ❯ next ../../node_modules/express/lib/router/route.js:149:13 ❯ Route.dispatch ../../node_modules/express/lib/router/route.js:119:3 ❯ Layer.handle [as handle_request] ../../node_modules/express/lib/router/layer.js:95:5 ❯ ../../node_modules/express/lib/router/index.js:284:15 ❯ param ../../node_modules/express/lib/router/index.js:365:14 ❯ param ../../node_modules/express/lib/router/index.js:376:14
suites/integrations/http-server/test.ts > Captures JSON request body: dev-packages/cloudflare-integration-tests/runner.ts#L264
AssertionError: expected [ { …(4) }, …(1) ] to deeply equal [ { …(4) }, …(1) ] - Expected + Received @@ -55,10 +55,11 @@ }, ], "version": "11.0.0", }, "timestamp": Any<Number>, + "transaction": "POST /post-json", "user": { "ip_address": "127.0.0.1", }, }, ], ❯ assertEnvelopeMatches runner.ts:264:28 ❯ newEnvelope runner.ts:328:13 ❯ ../test-utils/src/server.ts:19:7 ❯ Layer.handle [as handle_request] ../../node_modules/express/lib/router/layer.js:95:5 ❯ next ../../node_modules/express/lib/router/route.js:149:13 ❯ Route.dispatch ../../node_modules/express/lib/router/route.js:119:3 ❯ Layer.handle [as handle_request] ../../node_modules/express/lib/router/layer.js:95:5 ❯ ../../node_modules/express/lib/router/index.js:284:15 ❯ param ../../node_modules/express/lib/router/index.js:365:14 ❯ param ../../node_modules/express/lib/router/index.js:376:14
suites/double-instrumentation/test.ts > Only sends one error event when withSentry is called twice: dev-packages/cloudflare-integration-tests/runner.ts#L264
AssertionError: expected [ { …(4) }, …(1) ] to deeply equal [ { …(4) }, …(1) ] - Expected + Received @@ -68,10 +68,11 @@ }, ], "version": "11.0.0", }, "timestamp": Any<Number>, + "transaction": "GET /error", "user": { "ip_address": "127.0.0.1", }, }, ], ❯ assertEnvelopeMatches runner.ts:264:28 ❯ newEnvelope runner.ts:328:13 ❯ ../test-utils/src/server.ts:19:7 ❯ Layer.handle [as handle_request] ../../node_modules/express/lib/router/layer.js:95:5 ❯ next ../../node_modules/express/lib/router/route.js:149:13 ❯ Route.dispatch ../../node_modules/express/lib/router/route.js:119:3 ❯ Layer.handle [as handle_request] ../../node_modules/express/lib/router/layer.js:95:5 ❯ ../../node_modules/express/lib/router/index.js:284:15 ❯ param ../../node_modules/express/lib/router/index.js:365:14 ❯ param ../../node_modules/express/lib/router/index.js:376:14
suites/basic/test.ts > Basic error in fetch handler: dev-packages/cloudflare-integration-tests/runner.ts#L264
AssertionError: expected [ { …(4) }, …(1) ] to deeply equal [ { …(4) }, …(1) ] - Expected + Received @@ -68,10 +68,11 @@ }, ], "version": "11.0.0", }, "timestamp": Any<Number>, + "transaction": "GET /", "user": { "ip_address": "127.0.0.1", }, }, ], ❯ assertEnvelopeMatches runner.ts:264:28 ❯ newEnvelope runner.ts:328:13 ❯ ../test-utils/src/server.ts:19:7 ❯ Layer.handle [as handle_request] ../../node_modules/express/lib/router/layer.js:95:5 ❯ next ../../node_modules/express/lib/router/route.js:149:13 ❯ Route.dispatch ../../node_modules/express/lib/router/route.js:119:3 ❯ Layer.handle [as handle_request] ../../node_modules/express/lib/router/layer.js:95:5 ❯ ../../node_modules/express/lib/router/index.js:284:15 ❯ param ../../node_modules/express/lib/router/index.js:365:14 ❯ param ../../node_modules/express/lib/router/index.js:376:14
[chromium] › tests/performance/trace-propagation.test.ts:21:3 › Trace propagation › should have trace connection: ../../_temp/test-application/tests/performance/trace-propagation.test.ts#L50
10) [chromium] › tests/performance/trace-propagation.test.ts:21:3 › Trace propagation › should have trace connection Error: expect(received).toBeDefined() Received: undefined Call Log: - Timeout 10000ms exceeded while waiting on the predicate 48 | const findServerSegmentSpan = () => 49 | streamedSpans.find(span => getSpanOp(span) === 'http.server' && span.is_segment && span.trace_id === traceId); > 50 | await expect.poll(findServerSegmentSpan).toBeDefined(); | ^ 51 | 52 | const requestHandlerSpan = streamedSpans.find(span => span.span_id === handlerSpanId); 53 | expect(requestHandlerSpan).toBeDefined(); at /home/runner/work/_temp/test-application/tests/performance/trace-propagation.test.ts:50:46
[chromium] › tests/performance/trace-propagation.test.ts:7:3 › Trace propagation › should inject metatags in ssr pageload: ../../_temp/test-application/tests/performance/trace-propagation.test.ts#L11
9) [chromium] › tests/performance/trace-propagation.test.ts:7:3 › Trace propagation › should inject metatags in ssr pageload Error: expect(received).toMatch(expected) Expected pattern: /^[a-f0-9]{32}-[a-f0-9]{16}-[01]$/ Received string: "72f9de03e8154d47a5eec714486204db-982b79f98456f84e" 9 | const sentryTraceContent = await page.getAttribute('meta[name="sentry-trace"]', 'content'); 10 | expect(sentryTraceContent).toBeDefined(); > 11 | expect(sentryTraceContent).toMatch(/^[a-f0-9]{32}-[a-f0-9]{16}-[01]$/); | ^ 12 | const baggageContent = await page.getAttribute('meta[name="baggage"]', 'content'); 13 | expect(baggageContent).toBeDefined(); 14 | expect(baggageContent).toContain('sentry-environment=qa'); at /home/runner/work/_temp/test-application/tests/performance/trace-propagation.test.ts:11:32
[chromium] › tests/performance/redis.server.test.ts:6:3 › server - redis db spans › server loader emits db.query child spans on the http.server segment: ../../_temp/test-application/tests/performance/redis.server.test.ts#L0
8) [chromium] › tests/performance/redis.server.test.ts:6:3 › server - redis db spans › server loader emits db.query child spans on the http.server segment Test timeout of 30000ms exceeded.
[chromium] › tests/performance/performance.server.test.ts:39:3 › server - performance › should send server span on parameterized route: ../../_temp/test-application/tests/performance/performance.server.test.ts#L0
7) [chromium] › tests/performance/performance.server.test.ts:39:3 › server - performance › should send server span on parameterized route Test timeout of 30000ms exceeded.
[chromium] › tests/performance/performance.server.test.ts:6:3 › server - performance › should send server span on pageload: ../../_temp/test-application/tests/performance/performance.server.test.ts#L0
6) [chromium] › tests/performance/performance.server.test.ts:6:3 › server - performance › should send server span on pageload Test timeout of 30000ms exceeded.
[chromium] › tests/performance/mysql.server.test.ts:32:3 › server - mysql db spans › a nested query lands on the same segment (async context restored): ../../_temp/test-application/tests/performance/mysql.server.test.ts#L0
5) [chromium] › tests/performance/mysql.server.test.ts:32:3 › server - mysql db spans › a nested query lands on the same segment (async context restored) Test timeout of 30000ms exceeded.
[chromium] › tests/performance/mysql.server.test.ts:8:3 › server - mysql db spans › a real mysql query emits a db span with orchestrion-channel attributes: ../../_temp/test-application/tests/performance/mysql.server.test.ts#L0
4) [chromium] › tests/performance/mysql.server.test.ts:8:3 › server - mysql db spans › a real mysql query emits a db span with orchestrion-channel attributes Test timeout of 30000ms exceeded.
[chromium] › tests/performance/middleware.server.test.ts:6:3 › server - middleware › should send middleware span on pageload: ../../_temp/test-application/tests/performance/middleware.server.test.ts#L0
3) [chromium] › tests/performance/middleware.server.test.ts:6:3 › server - middleware › should send middleware span on pageload Test timeout of 30000ms exceeded.
[chromium] › tests/errors/errors.server.test.ts:55:3 › server-side errors › captures error thrown in server action: ../../_temp/test-application/tests/errors/errors.server.test.ts#L66
2) [chromium] › tests/errors/errors.server.test.ts:55:3 › server-side errors › captures error thrown in server action Error: expect(received).toMatchObject(expected) - Expected - 5 + Received + 0 @@ -18,19 +18,14 @@ }, ], }, "level": "error", "platform": "node", - "request": Object { - "headers": Any<Object>, - "url": StringContaining "errors/server-action", - }, "sdk": Object { "integrations": Any<Array>, "name": "sentry.javascript.react-router", "version": Any<String>, }, "tags": Object { "runtime": "node", }, - "transaction": "POST /errors/server-action.data", } 64 | const error = await errorPromise; 65 | > 66 | expect(error).toMatchObject({ | ^ 67 | exception: { 68 | values: [ 69 | { at /home/runner/work/_temp/test-application/tests/errors/errors.server.test.ts:66:19
[chromium] › tests/errors/errors.server.test.ts:6:3 › server-side errors › captures error thrown in server loader: ../../_temp/test-application/tests/errors/errors.server.test.ts#L16
1) [chromium] › tests/errors/errors.server.test.ts:6:3 › server-side errors › captures error thrown in server loader Error: expect(received).toMatchObject(expected) - Expected - 5 + Received + 0 @@ -18,19 +18,14 @@ }, ], }, "level": "error", "platform": "node", - "request": Object { - "headers": Any<Object>, - "url": StringContaining "errors/server-loader", - }, "sdk": Object { "integrations": Any<Array>, "name": "sentry.javascript.react-router", "version": Any<String>, }, "tags": Object { "runtime": "node", }, - "transaction": "GET /errors/server-loader", } 14 | const error = await errorPromise; 15 | > 16 | expect(error).toMatchObject({ | ^ 17 | exception: { 18 | values: [ 19 | { at /home/runner/work/_temp/test-application/tests/errors/errors.server.test.ts:16:19
All required jobs passed or were skipped
Process completed with exit code 1.
🎭 Playwright Run Summary
1 passed (5.9s)
🎭 Playwright Run Summary
10 passed (10.4s)
🎭 Playwright Run Summary
1 passed (5.8s)
🎭 Playwright Run Summary
1 passed (2.9s)
🎭 Playwright Run Summary
1 skipped 19 passed (1.5s)
🎭 Playwright Run Summary
9 passed (3.6s)
🎭 Playwright Run Summary
9 passed (3.7s)
🎭 Playwright Run Summary
23 passed (12.9s)
🎭 Playwright Run Summary
14 passed (15.6s)
🎭 Playwright Run Summary
3 passed (4.1s)
🎭 Playwright Run Summary
10 passed (18.5s)
🎭 Playwright Run Summary
7 passed (3.2s)
🎭 Playwright Run Summary
11 passed (11.3s)
🎭 Playwright Run Summary
1 skipped 73 passed (15.4s)
🎭 Playwright Run Summary
3 passed (12.6s)
🎭 Playwright Run Summary
3 passed (11.1s)
🎭 Playwright Run Summary
4 passed (7.0s)
🎭 Playwright Run Summary
10 passed (4.3s)
🎭 Playwright Run Summary
10 passed (5.1s)
🎭 Playwright Run Summary
9 passed (13.5s)
🎭 Playwright Run Summary
11 passed (7.1s)
🎭 Playwright Run Summary
4 passed (7.4s)
🎭 Playwright Run Summary
7 passed (9.5s)
🎭 Playwright Run Summary
23 passed (22.4s)
🎭 Playwright Run Summary
4 skipped 10 passed (14.9s)
🎭 Playwright Run Summary
2 passed (16.9s)
🎭 Playwright Run Summary
8 skipped 22 passed (10.5s)
🎭 Playwright Run Summary
12 passed (11.3s)
🎭 Playwright Run Summary
8 passed (11.8s)
🎭 Playwright Run Summary
2 passed (3.5s)
🎭 Playwright Run Summary
2 passed (3.5s)
🎭 Playwright Run Summary
11 passed (21.1s)
🎭 Playwright Run Summary
8 skipped 6 passed (12.3s)
🎭 Playwright Run Summary
10 passed (10.2s)
🎭 Playwright Run Summary
9 passed (11.5s)
🎭 Playwright Run Summary
5 passed (7.0s)
🎭 Playwright Run Summary
4 passed (9.3s)
🎭 Playwright Run Summary
1 passed (3.4s)
🎭 Playwright Run Summary
12 passed (6.4s)
🎭 Playwright Run Summary
5 skipped 25 passed (12.2s)
🎭 Playwright Run Summary
22 passed (17.0s)
🎭 Playwright Run Summary
11 skipped 2 passed (3.0s)
🎭 Playwright Run Summary
1 skipped 73 passed (14.5s)
🎭 Playwright Run Summary
8 passed (10.0s)
🎭 Playwright Run Summary
9 passed (14.2s)
🎭 Playwright Run Summary
4 passed (10.2s)
🎭 Playwright Run Summary
16 passed (10.6s)
🎭 Playwright Run Summary
1 passed (3.4s)
🎭 Playwright Run Summary
7 passed (11.2s)
🎭 Playwright Run Summary
489 skipped 195 passed (30.9s)
🎭 Playwright Run Summary
3 passed (7.0s)
🎭 Playwright Run Summary
5 passed (12.7s)
🎭 Playwright Run Summary
4 passed (11.9s)
🎭 Playwright Run Summary
3 passed (16.6s)
🎭 Playwright Run Summary
3 passed (12.2s)
🎭 Playwright Run Summary
1 failed [chromium] › tests/index.test.ts:42:5 › Websocket.webSocketMessage ───────────────────────────── 2 skipped 9 passed (9.7s)
🎭 Playwright Run Summary
2 skipped 10 passed (6.6s)
🎭 Playwright Run Summary
30 passed (33.3s)
🎭 Playwright Run Summary
7 passed (5.1s)
🎭 Playwright Run Summary
1 passed (4.6s)
🎭 Playwright Run Summary
3 passed (4.9s)
🎭 Playwright Run Summary
1 skipped 29 passed (21.2s)
🎭 Playwright Run Summary
5 passed (9.0s)
🎭 Playwright Run Summary
13 passed (44.5s)
🎭 Playwright Run Summary
4 passed (4.4s)
🎭 Playwright Run Summary
1 passed (6.4s)
🎭 Playwright Run Summary
7 skipped 23 passed (10.6s)
🎭 Playwright Run Summary
2 passed (4.4s)
🎭 Playwright Run Summary
4 passed (3.5s)
🎭 Playwright Run Summary
16 passed (20.6s)
🎭 Playwright Run Summary
17 passed (30.8s)
🎭 Playwright Run Summary
11 passed (11.2s)
🎭 Playwright Run Summary
7 skipped 23 passed (11.1s)
🎭 Playwright Run Summary
2 skipped 14 passed (16.8s)
🎭 Playwright Run Summary
12 passed (10.1s)
🎭 Playwright Run Summary
11 passed (11.5s)
🎭 Playwright Run Summary
15 passed (10.5s)
🎭 Playwright Run Summary
4 passed (33.9s)
🎭 Playwright Run Summary
4 passed (5.8s)
🎭 Playwright Run Summary
1 skipped 73 passed (14.9s)
🎭 Playwright Run Summary
16 passed (20.3s)
🎭 Playwright Run Summary
1 skipped 73 passed (15.3s)
🎭 Playwright Run Summary
8 passed (7.3s)
🎭 Playwright Run Summary
10 passed (19.0s)
🎭 Playwright Run Summary
19 passed (15.8s)
🎭 Playwright Run Summary
5 passed (10.9s)
🎭 Playwright Run Summary
8 passed (8.7s)
🎭 Playwright Run Summary
25 passed (22.6s)
🎭 Playwright Run Summary
4 skipped 26 passed (20.3s)
🎭 Playwright Run Summary
7 passed (16.9s)
🎭 Playwright Run Summary
10 passed (30.5s)
🎭 Playwright Run Summary
11 passed (9.7s)
🎭 Playwright Run Summary
11 passed (11.2s)
🎭 Playwright Run Summary
5 passed (12.0s)
🎭 Playwright Run Summary
4 passed (3.5s)
🎭 Playwright Run Summary
14 passed (42.7s)
🎭 Playwright Run Summary
1 passed (4.7s)
🎭 Playwright Run Summary
1 skipped 12 passed (28.0s)
🎭 Playwright Run Summary
5 passed (13.2s)
🎭 Playwright Run Summary
1 skipped 19 passed (8.2s)
🎭 Playwright Run Summary
1 skipped 16 passed (32.2s)
🎭 Playwright Run Summary
14 passed (42.8s)
🎭 Playwright Run Summary
3 passed (18.2s)
🎭 Playwright Run Summary
3 passed (13.2s)
🎭 Playwright Run Summary
5 passed (8.9s)
🎭 Playwright Run Summary
5 passed (13.5s)
🎭 Playwright Run Summary
13 passed (30.1s)
🎭 Playwright Run Summary
5 skipped 25 passed (18.1s)
🎭 Playwright Run Summary
23 passed (20.6s)
🎭 Playwright Run Summary
4 passed (19.1s)
🎭 Playwright Run Summary
4 passed (10.7s)
🎭 Playwright Run Summary
5 passed (15.5s)
🎭 Playwright Run Summary
10 passed (12.9s)
🎭 Playwright Run Summary
4 passed (10.6s)
🎭 Playwright Run Summary
5 passed (11.6s)
🎭 Playwright Run Summary
486 skipped 198 passed (39.3s)
🎭 Playwright Run Summary
13 passed (43.7s)
🎭 Playwright Run Summary
6 passed (14.2s)
🎭 Playwright Run Summary
25 passed (50.9s)
🎭 Playwright Run Summary
6 passed (14.8s)
🎭 Playwright Run Summary
16 passed (8.6s)
🎭 Playwright Run Summary
1 passed (3.6s)
🎭 Playwright Run Summary
1 passed (3.7s)
🎭 Playwright Run Summary
12 passed (40.7s)
🎭 Playwright Run Summary
5 passed (9.4s)
🎭 Playwright Run Summary
4 passed (22.3s)
🎭 Playwright Run Summary
4 passed (12.7s)
🎭 Playwright Run Summary
4 passed (4.4s)
🎭 Playwright Run Summary
2 passed (31.6s)
🎭 Playwright Run Summary
22 skipped 2 passed (4.4s)
🎭 Playwright Run Summary
2 passed (2.0s)
🎭 Playwright Run Summary
3 passed (6.0s)
🎭 Playwright Run Summary
6 passed (13.7s)
🎭 Playwright Run Summary
12 passed (17.1s)
🎭 Playwright Run Summary
12 passed (17.4s)
🎭 Playwright Run Summary
9 passed (13.8s)
🎭 Playwright Run Summary
3 skipped 17 passed (8.3s)
🎭 Playwright Run Summary
30 passed (35.1s)
🎭 Playwright Run Summary
3 passed (7.3s)
🎭 Playwright Run Summary
4 passed (12.1s)
🎭 Playwright Run Summary
5 passed (33.9s)
🎭 Playwright Run Summary
5 passed (32.4s)
🎭 Playwright Run Summary
12 passed (35.6s)
🎭 Playwright Run Summary
12 passed (42.4s)
🎭 Playwright Run Summary
22 skipped 2 passed (3.0s)
🎭 Playwright Run Summary
2 passed (17.1s)
🎭 Playwright Run Summary
13 passed (33.9s)
🎭 Playwright Run Summary
2 skipped 7 passed (30.8s)
🎭 Playwright Run Summary
10 passed (42.7s)
🎭 Playwright Run Summary
53 passed (39.4s)
🎭 Playwright Run Summary
2 passed (17.7s)
🎭 Playwright Run Summary
15 passed (45.6s)
🎭 Playwright Run Summary
3 passed (20.8s)
🎭 Playwright Run Summary
3 passed (13.3s)
🎭 Playwright Run Summary
3 passed (16.8s)
🎭 Playwright Run Summary
3 passed (11.5s)
🎭 Playwright Run Summary
24 passed (1.1m)
🎭 Playwright Run Summary
3 passed (4.1s)
🎭 Playwright Run Summary
15 passed (1.2m)
🎭 Playwright Run Summary
11 passed (21.2s)
🎭 Playwright Run Summary
10 passed (22.9s)
🎭 Playwright Run Summary
10 passed (13.4s)
🎭 Playwright Run Summary
12 passed (33.9s)
🎭 Playwright Run Summary
9 passed (12.3s)
🎭 Playwright Run Summary
5 passed (12.8s)
🎭 Playwright Run Summary
14 passed (42.6s)
🎭 Playwright Run Summary
4 passed (3.4s)
🎭 Playwright Run Summary
3 passed (29.9s)
🎭 Playwright Run Summary
2 passed (46.9s)
🎭 Playwright Run Summary
11 passed (20.7s)
🎭 Playwright Run Summary
15 passed (20.3s)
🎭 Playwright Run Summary
10 passed (34.4s)
🎭 Playwright Run Summary
9 passed (37.7s)
🎭 Playwright Run Summary
4 passed (16.9s)
🎭 Playwright Run Summary
11 passed (43.9s)
🎭 Playwright Run Summary
21 skipped 3 passed (5.4s)
🎭 Playwright Run Summary
13 passed (52.6s)
🎭 Playwright Run Summary
22 passed (46.9s)
🎭 Playwright Run Summary
14 passed (42.8s)
🎭 Playwright Run Summary
3 passed (39.5s)
🎭 Playwright Run Summary
3 passed (8.0s)
🎭 Playwright Run Summary
2 passed (5.8s)
🎭 Playwright Run Summary
6 passed (34.4s)
🎭 Playwright Run Summary
9 passed (22.3s)
🎭 Playwright Run Summary
9 passed (7.6s)
🎭 Playwright Run Summary
40 passed (34.0s)
🎭 Playwright Run Summary
4 passed (13.5s)
🎭 Playwright Run Summary
2 passed (33.0s)
🎭 Playwright Run Summary
12 passed (41.5s)
🎭 Playwright Run Summary
12 passed (22.5s)
🎭 Playwright Run Summary
25 passed (52.6s)
🎭 Playwright Run Summary
14 passed (33.3s)
🎭 Playwright Run Summary
10 passed (41.8s)
🎭 Playwright Run Summary
6 passed (44.7s)
🎭 Playwright Run Summary
13 passed (35.0s)
🎭 Playwright Run Summary
16 skipped 12 passed (28.3s)
🎭 Playwright Run Summary
11 passed (38.9s)
🎭 Playwright Run Summary
1 skipped 11 passed (24.6s)
🎭 Playwright Run Summary
12 passed (8.7s)
🎭 Playwright Run Summary
16 skipped 12 passed (25.3s)
🎭 Playwright Run Summary
9 passed (16.2s)
🎭 Playwright Run Summary
4 passed (14.7s)
🎭 Playwright Run Summary
10 passed (52.7s)
🎭 Playwright Run Summary
9 passed (33.6s)
🎭 Playwright Run Summary
22 skipped 2 passed (4.9s)
🎭 Playwright Run Summary
22 passed (53.2s)
🎭 Playwright Run Summary
4 passed (38.3s)
🎭 Playwright Run Summary
4 passed (9.8s)
🎭 Playwright Run Summary
13 passed (53.0s)
🎭 Playwright Run Summary
13 passed (14.5s)
🎭 Playwright Run Summary
5 passed (34.3s)
🎭 Playwright Run Summary
5 passed (34.5s)
🎭 Playwright Run Summary
24 passed (1.6m)
🎭 Playwright Run Summary
1 failed [chromium] › tests/performance/trace-propagation.test.ts:20:3 › Trace propagation › should have trace connection 21 passed (1.1m)
🎭 Playwright Run Summary
40 passed (34.9s)
🎭 Playwright Run Summary
2 passed (17.9s)
🎭 Playwright Run Summary
13 passed (40.1s)
🎭 Playwright Run Summary
355 skipped 329 passed (1.3m)
🎭 Playwright Run Summary
9 passed (14.2s)
🎭 Playwright Run Summary
2 passed (17.1s)
🎭 Playwright Run Summary
18 passed (49.0s)
🎭 Playwright Run Summary
3 passed (36.3s)
🎭 Playwright Run Summary
3 passed (4.0s)
🎭 Playwright Run Summary
10 passed (10.7s)
🎭 Playwright Run Summary
6 skipped 7 passed (30.9s)
🎭 Playwright Run Summary
13 passed (18.1s)
🎭 Playwright Run Summary
5 passed (48.2s)
🎭 Playwright Run Summary
5 passed (13.7s)
🎭 Playwright Run Summary
13 passed (52.3s)
🎭 Playwright Run Summary
13 passed (14.7s)
🎭 Playwright Run Summary
10 passed (27.3s)
🎭 Playwright Run Summary
10 passed (6.7s)
🎭 Playwright Run Summary
2 passed (18.0s)
🎭 Playwright Run Summary
18 passed (1.1m)
🎭 Playwright Run Summary
15 passed (31.4s)
🎭 Playwright Run Summary
17 passed (1.0m)
🎭 Playwright Run Summary
12 passed (40.0s)
🎭 Playwright Run Summary
4 passed (14.4s)
🎭 Playwright Run Summary
4 skipped 51 passed (1.2m)
🎭 Playwright Run Summary
354 skipped 330 passed (1.4m)
🎭 Playwright Run Summary
17 passed (1.3m)
🎭 Playwright Run Summary
491 skipped 193 passed (41.1s)
🎭 Playwright Run Summary
24 passed (1.2m)
🎭 Playwright Run Summary
2 passed (20.3s)
🎭 Playwright Run Summary
2 skipped 21 passed (39.4s)
🎭 Playwright Run Summary
24 passed (1.2m)
🎭 Playwright Run Summary
4 skipped 12 passed (37.2s)
🎭 Playwright Run Summary
2 skipped 14 passed (17.0s)
🎭 Playwright Run Summary
9 passed (48.7s)
🎭 Playwright Run Summary
9 passed (7.5s)
🎭 Playwright Run Summary
2 passed (19.1s)
🎭 Playwright Run Summary
15 passed (51.6s)
🎭 Playwright Run Summary
13 passed (51.9s)
🎭 Playwright Run Summary
13 passed (16.0s)
🎭 Playwright Run Summary
1 skipped 11 passed (50.1s)
🎭 Playwright Run Summary
12 passed (9.7s)
🎭 Playwright Run Summary
4 skipped 30 passed (58.0s)
🎭 Playwright Run Summary
2 skipped 32 passed (1.3m)
🎭 Playwright Run Summary
3 passed (39.1s)
🎭 Playwright Run Summary
3 passed (12.7s)
🎭 Playwright Run Summary
4 skipped 12 passed (32.3s)
🎭 Playwright Run Summary
2 skipped 14 passed (19.0s)
🎭 Playwright Run Summary
14 passed (41.4s)
🎭 Playwright Run Summary
6 skipped 7 passed (54.1s)
🎭 Playwright Run Summary
13 passed (18.5s)
🎭 Playwright Run Summary
2 passed (21.3s)
🎭 Playwright Run Summary
3 skipped 21 passed (45.2s)
🎭 Playwright Run Summary
1 skipped 5 passed (27.5s)
🎭 Playwright Run Summary
58 passed (1.6m)
🎭 Playwright Run Summary
5 skipped 30 passed (1.4m)
🎭 Playwright Run Summary
5 skipped 30 passed (50.7s)
🎭 Playwright Run Summary
4 skipped 167 passed (2.5m)
🎭 Playwright Run Summary
2 passed (19.9s)
🎭 Playwright Run Summary
11 passed (40.4s)
🎭 Playwright Run Summary
4 passed (23.6s)
🎭 Playwright Run Summary
1 skipped 5 passed (29.2s)
🎭 Playwright Run Summary
58 passed (1.7m)
🎭 Playwright Run Summary
1 skipped 5 passed (29.5s)
🎭 Playwright Run Summary
67 passed (2.2m)
🎭 Playwright Run Summary
67 passed (2.2m)
🎭 Playwright Run Summary
1 skipped 5 passed (30.1s)
🎭 Playwright Run Summary
58 passed (1.7m)
🎭 Playwright Run Summary
44 passed (2.6m)
🎭 Playwright Run Summary
1 skipped 170 passed (2.5m)
🎭 Playwright Run Summary
193 skipped 491 passed (3.3m)
🎭 Playwright Run Summary
16 skipped 32 passed (1.9m)
🎭 Playwright Run Summary
5 skipped 43 passed (1.5m)
🎭 Playwright Run Summary
15 skipped 32 passed (1.8m)
🎭 Playwright Run Summary
5 skipped 42 passed (1.4m)
🎭 Playwright Run Summary
1 skipped 5 passed (32.2s)
🎭 Playwright Run Summary
67 passed (2.2m)
🎭 Playwright Run Summary
1 skipped 5 passed (32.6s)
🎭 Playwright Run Summary
67 passed (2.2m)
🎭 Playwright Run Summary
5 skipped 30 passed (2.4m)
🎭 Playwright Run Summary
4 skipped 31 passed (51.7s)
🎭 Playwright Run Summary
16 skipped 32 passed (1.8m)
🎭 Playwright Run Summary
5 skipped 43 passed (1.7m)
🎭 Playwright Run Summary
187 skipped 497 passed (3.4m)
🎭 Playwright Run Summary
5 skipped 30 passed (2.4m)
🎭 Playwright Run Summary
4 skipped 31 passed (51.1s)
🎭 Playwright Run Summary
197 skipped 487 passed (3.3m)
🎭 Playwright Run Summary
5 skipped 166 passed (3.0m)
🎭 Playwright Run Summary
10 failed [chromium] › tests/errors/errors.server.test.ts:6:3 › server-side errors › captures error thrown in server loader [chromium] › tests/errors/errors.server.test.ts:55:3 › server-side errors › captures error thrown in server action [chromium] › tests/performance/middleware.server.test.ts:6:3 › server - middleware › should send middleware span on pageload [chromium] › tests/performance/mysql.server.test.ts:8:3 › server - mysql db spans › a real mysql query emits a db span with orchestrion-channel attributes [chromium] › tests/performance/mysql.server.test.ts:32:3 › server - mysql db spans › a nested query lands on the same segment (async context restored) [chromium] › tests/performance/performance.server.test.ts:6:3 › server - performance › should send server span on pageload [chromium] › tests/performance/performance.server.test.ts:39:3 › server - performance › should send server span on parameterized route [chromium] › tests/performance/redis.server.test.ts:6:3 › server - redis db spans › server loader emits db.query child spans on the http.server segment [chromium] › tests/performance/trace-propagation.test.ts:7:3 › Trace propagation › should inject metatags in ssr pageload [chromium] › tests/performance/trace-propagation.test.ts:21:3 › Trace propagation › should have trace connection 14 passed (4.4m)
🎭 Playwright Run Summary
16 skipped 32 passed (1.9m)
🎭 Playwright Run Summary
5 skipped 43 passed (1.6m)
🎭 Playwright Run Summary
60 skipped 624 passed (4.3m)
🎭 Playwright Run Summary
56 skipped 628 passed (4.4m)
🎭 Playwright Run Summary
2 skipped 32 passed (2.6m)
🎭 Playwright Run Summary
2 skipped 32 passed (1.2m)
🎭 Playwright Run Summary
2 skipped 32 passed (2.7m)
🎭 Playwright Run Summary
2 skipped 32 passed (1.3m)
🎭 Playwright Run Summary
56 skipped 628 passed (4.4m)
🎭 Playwright Run Summary
4 skipped 167 passed (3.8m)
🎭 Playwright Run Summary
13 skipped 35 passed (2.9m)
🎭 Playwright Run Summary
5 skipped 43 passed (1.5m)
🎭 Playwright Run Summary
60 skipped 624 passed (4.4m)
🎭 Playwright Run Summary
58 skipped 626 passed (4.3m)
🎭 Playwright Run Summary
13 skipped 35 passed (3.1m)
🎭 Playwright Run Summary
5 skipped 43 passed (1.6m)
🎭 Playwright Run Summary
13 skipped 35 passed (3.0m)
🎭 Playwright Run Summary
5 skipped 43 passed (1.5m)

Artifacts

Produced during runtime
Name Size Digest
build-bundle-output
20.3 MB
sha256:38a8eea3248159df15d512f506a0595d412cf671f93bb0b8c82dba13fcee38b1
build-layer-output
1.34 MB
sha256:61de40b152fc5df54d7ce0ac5bc2c87b67bef908502ed72879678ab74248fff8
build-output
14.2 MB
sha256:f7de26866a569dbdb5d45f9a44aa9499c5762b950a37f31b16fdf60bfbdf8204
build-tarball-output
7.25 MB
sha256:e5ba429c1a4d8fd8805c78c81e3ee17aab84d0c5505e5fa2c822118e238391b4
playwright-traces-job_e2e_playwright_tests-cloudflare-workers-static
7.57 KB
sha256:0332333cb641f2d22a4fb7f0417d110fbdfa21af49d25c0afb907c1e69993bfe
playwright-traces-job_e2e_playwright_tests-react-router-7-framework-static
14.5 KB
sha256:09498b7981f49b150de0774692554a44469c1aa467a7a9b7e01790a8ec1c76a2