Skip to content

chore: Update base node version to 24.21.0 #57885

chore: Update base node version to 24.21.0

chore: Update base node version to 24.21.0 #57885

Triggered via pull request September 14, 2026 06:34
Status Failure
Total duration 14m 13s
Artifacts –

build.yml

on: pull_request
Get CI Metadata  /  Get Metadata
6s
Get CI Metadata / Get Metadata
Check lockfile
2m 48s
Check lockfile
Check file formatting
44s
Check file formatting
Check PR branches
3s
Check PR branches
Build Lambda layer
1m 1s
Build Lambda layer
Matrix: job_bundler_plugin_integration_tests
Matrix: job_node_integration_tests
Matrix: job_node_unit_tests
Lint
1m 35s
Lint
Circular Dependency Check
1m 38s
Circular Dependency Check
Browser Unit Tests
1m 49s
Browser Unit Tests
Bun Unit Tests
42s
Bun Unit Tests
Deno Unit Tests
1m 3s
Deno Unit Tests
Cloudflare Integration Tests
5m 9s
Cloudflare Integration Tests
Bun Integration Tests
1m 0s
Bun Integration Tests
Deno Integration Tests
1m 0s
Deno Integration Tests
Check for faulty .d.ts files
38s
Check for faulty .d.ts files
Matrix: job_browser_loader_tests
Matrix: job_browser_playwright_tests
Matrix: job_optional_e2e_tests
Upload Artifacts
0s
Upload Artifacts
Matrix: job_e2e_tests
All required jobs passed or were skipped
6s
All required jobs passed or were skipped
Fit to window
Zoom out
Zoom in

Annotations

27 errors and 306 notices
Deno Integration Tests
Process completed with exit code 1.
E2E cloudflare-agent Test (optional)
Process completed with exit code 1.
E2E node-fastify-6 Test (optional)
Process completed with exit code 1.
[chromium] β€Ί tests/spans.test.ts:119:5 β€Ί Captures request metadata: ../../_temp/test-application/tests/spans.test.ts#L142
4) [chromium] β€Ί tests/spans.test.ts:119:5 β€Ί Captures request metadata ──────────────────────────── Error: expect(received).toEqual(expected) // deep equality Expected: StringContaining "" Received: undefined 140 | ); 141 | expect(segmentEvent.attributes['http.request.method']?.value).toEqual('POST'); > 142 | expect(segmentEvent.attributes['http.request.header.user_agent']?.value).toEqual(expect.stringContaining('')); | ^ 143 | expect(segmentEvent.attributes['http.request.header.content_type']?.value).toEqual('application/json'); 144 | 145 | expect(segmentEvent.attributes['http.request.body.data']?.value).toBe(JSON.stringify({ foo: 'bar', other: 1 })); at /home/runner/work/_temp/test-application/tests/spans.test.ts:142:76
[chromium] β€Ί tests/spans.test.ts:4:5 β€Ί Sends an API route span: ../../_temp/test-application/tests/spans.test.ts#L17
3) [chromium] β€Ί tests/spans.test.ts:4:5 β€Ί Sends an API route span ──────────────────────────────── Error: expect(received).toEqual(expected) // deep equality - Expected - 14 + Received + 173 @@ -1,40 +1,90 @@ - ObjectContaining { - "attributes": ObjectContaining { + Object { + "attributes": Object { + "app.free_memory": Object { + "type": "integer", + "value": 14511370240, + }, + "app.memory": Object { + "type": "integer", + "value": 380252160, + }, + "app.start_time": Object { + "type": "string", + "value": "2026-09-14T06:39:15.471Z", + }, "client.address": Object { "type": "string", "value": "::1", }, "client.port": Object { + "type": "integer", + "value": 50218, + }, + "culture.locale": Object { + "type": "string", + "value": "en-US", + }, + "culture.timezone": Object { + "type": "string", + "value": "UTC", + }, + "device.archs": Object { + "type": "array", + "value": Array [ + "x64", + ], + }, + "device.boot_time": Object { + "type": "string", + "value": "2026-09-14T06:37:31.195Z", + }, + "device.cpu_description": Object { + "type": "string", + "value": "AMD EPYC 9V74 80-Core Processor", + }, + "device.free_memory": Object { + "type": "integer", + "value": 14511370240, + }, + "device.memory_size": Object { "type": "integer", - "value": Any<Number>, + "value": 16766414848, + }, + "device.processor_count": Object { + "type": "integer", + "value": 4, + }, + "device.processor_frequency": Object { + "type": "integer", + "value": 0, }, "http.request.header.accept": Object { "type": "string", "value": "*/*", }, - "http.request.header.accept_encoding": Object { + "http.request.header.accept-encoding": Object { "type": "string", "value": "gzip, deflate", }, - "http.request.header.accept_language": Object { + "http.request.header.accept-language": Object { "type": "string", "value": "*", }, "http.request.header.connection": Object { "type": "string", "value": "keep-alive", }, "http.request.header.host": Object { "type": "string", - "value": Any<String>, + "value": "localhost:3030", }, - "http.request.header.sec_fetch_mode": Object { + "http.request.header.sec-fetch-mode": Object { "type": "string", "value": "cors", }, - "http.request.header.user_agent": Object { + "http.request.header.user-agent": Object { "type": "string", "value": "node", }, "http.request.method": Object { "type": "string", @@ -52,23 +102,23 @@ "type": "string", "value": "/test-transaction", }, "network.local.address": Object { "type": "string", - "value": Any<String>, + "value": "::1", }, "network.local.port": Object { "type": "integer", - "value": Any<Number>, + "value": 3030, }, "network.peer.address": Object { "type": "string", - "value": Any<String>, + "value": "::1", }, "network.peer.port": Object { "type": "integer", - "value": Any<Number>, + "value": 50218, }, "network.protocol.name": Object {
[chromium] β€Ί tests/propagation.test.ts:146:5 β€Ί Propagates trace for outgoing fetch requests: ../../_temp/test-application/tests/propagation.test.ts#L205
2) [chromium] β€Ί tests/propagation.test.ts:146:5 β€Ί Propagates trace for outgoing fetch requests ─── Error: expect(received).toEqual(expected) // deep equality - Expected - 13 + Received + 172 @@ -1,40 +1,90 @@ - ObjectContaining { - "attributes": ObjectContaining { + Object { + "attributes": Object { + "app.free_memory": Object { + "type": "integer", + "value": 14478745600, + }, + "app.memory": Object { + "type": "integer", + "value": 372883456, + }, + "app.start_time": Object { + "type": "string", + "value": "2026-09-14T06:39:15.471Z", + }, "client.address": Object { "type": "string", "value": "::1", }, "client.port": Object { "type": "integer", - "value": Any<Number>, + "value": 44078, + }, + "culture.locale": Object { + "type": "string", + "value": "en-US", + }, + "culture.timezone": Object { + "type": "string", + "value": "UTC", + }, + "device.archs": Object { + "type": "array", + "value": Array [ + "x64", + ], + }, + "device.boot_time": Object { + "type": "string", + "value": "2026-09-14T06:37:31.195Z", + }, + "device.cpu_description": Object { + "type": "string", + "value": "AMD EPYC 9V74 80-Core Processor", + }, + "device.free_memory": Object { + "type": "integer", + "value": 14478745600, + }, + "device.memory_size": Object { + "type": "integer", + "value": 16766414848, + }, + "device.processor_count": Object { + "type": "integer", + "value": 4, }, + "device.processor_frequency": Object { + "type": "integer", + "value": 0, + }, "http.request.header.accept": Object { "type": "string", "value": "*/*", }, - "http.request.header.accept_encoding": Object { + "http.request.header.accept-encoding": Object { "type": "string", "value": "gzip, deflate", }, - "http.request.header.accept_language": Object { + "http.request.header.accept-language": Object { "type": "string", "value": "*", }, "http.request.header.connection": Object { "type": "string", "value": "keep-alive", }, "http.request.header.host": Object { "type": "string", - "value": Any<String>, + "value": "localhost:3030", }, - "http.request.header.sec_fetch_mode": Object { + "http.request.header.sec-fetch-mode": Object { "type": "string", "value": "cors", }, - "http.request.header.user_agent": Object { + "http.request.header.user-agent": Object { "type": "string", "value": "node", }, "http.request.method": Object { "type": "string", @@ -52,23 +102,23 @@ "type": "string", "value": "/test-outgoing-fetch/:id", }, "network.local.address": Object { "type": "string", - "value": Any<String>, + "value": "::1", }, "network.local.port": Object { "type": "integer", - "value": Any<Number>, + "value": 3030, }, "network.peer.address": Object { "type": "string", - "value": Any<String>, + "value": "::1", }, "network.peer.port": Object { "type": "integer", - "value": Any<Number>, + "value": 44078, }, "network.protocol.name": Object { "type": "string", "value": "h
[chromium] β€Ί tests/propagation.test.ts:5:5 β€Ί Propagates trace for outgoing http requests: ../../_temp/test-application/tests/propagation.test.ts#L64
1) [chromium] β€Ί tests/propagation.test.ts:5:5 β€Ί Propagates trace for outgoing http requests ────── Error: expect(received).toEqual(expected) // deep equality - Expected - 12 + Received + 171 @@ -1,24 +1,74 @@ - ObjectContaining { - "attributes": ObjectContaining { + Object { + "attributes": Object { + "app.free_memory": Object { + "type": "integer", + "value": 14438502400, + }, + "app.memory": Object { + "type": "integer", + "value": 364494848, + }, + "app.start_time": Object { + "type": "string", + "value": "2026-09-14T06:39:15.471Z", + }, "client.address": Object { "type": "string", "value": "::1", }, "client.port": Object { "type": "integer", - "value": Any<Number>, + "value": 44074, + }, + "culture.locale": Object { + "type": "string", + "value": "en-US", + }, + "culture.timezone": Object { + "type": "string", + "value": "UTC", + }, + "device.archs": Object { + "type": "array", + "value": Array [ + "x64", + ], + }, + "device.boot_time": Object { + "type": "string", + "value": "2026-09-14T06:37:31.195Z", + }, + "device.cpu_description": Object { + "type": "string", + "value": "AMD EPYC 9V74 80-Core Processor", + }, + "device.free_memory": Object { + "type": "integer", + "value": 14438502400, + }, + "device.memory_size": Object { + "type": "integer", + "value": 16766414848, + }, + "device.processor_count": Object { + "type": "integer", + "value": 4, + }, + "device.processor_frequency": Object { + "type": "integer", + "value": 0, }, "http.request.header.accept": Object { "type": "string", "value": "*/*", }, - "http.request.header.accept_encoding": Object { + "http.request.header.accept-encoding": Object { "type": "string", "value": "gzip, deflate", }, - "http.request.header.accept_language": Object { + "http.request.header.accept-language": Object { "type": "string", "value": "*", }, "http.request.header.connection": Object { "type": "string", @@ -26,15 +76,15 @@ }, "http.request.header.host": Object { "type": "string", "value": "localhost:3030", }, - "http.request.header.sec_fetch_mode": Object { + "http.request.header.sec-fetch-mode": Object { "type": "string", "value": "cors", }, - "http.request.header.user_agent": Object { + "http.request.header.user-agent": Object { "type": "string", "value": "node", }, "http.request.method": Object { "type": "string", @@ -52,23 +102,23 @@ "type": "string", "value": "/test-outgoing-http/:id", }, "network.local.address": Object { "type": "string", - "value": Any<String>, + "value": "::1", }, "network.local.port": Object { "type": "integer", - "value": Any<Number>, + "value": 3030, }, "network.peer.address": Object { "type": "string", - "value": Any<String>, + "value": "::1", }, "network.peer.port": Object { "type": "integer", - "value": Any<Number>, + "value": 44074, }, "network.protocol.name": Object { "type": "string", "value": "http", }, @@ -77,11 +127,35
E2E node-fastify-6 (tracer provider) Test (optional)
Process completed with exit code 1.
[chromium] β€Ί tests/spans.test.ts:119:5 β€Ί Captures request metadata: ../../_temp/test-application/tests/spans.test.ts#L142
4) [chromium] β€Ί tests/spans.test.ts:119:5 β€Ί Captures request metadata ──────────────────────────── Error: expect(received).toEqual(expected) // deep equality Expected: StringContaining "" Received: undefined 140 | ); 141 | expect(segmentEvent.attributes['http.request.method']?.value).toEqual('POST'); > 142 | expect(segmentEvent.attributes['http.request.header.user_agent']?.value).toEqual(expect.stringContaining('')); | ^ 143 | expect(segmentEvent.attributes['http.request.header.content_type']?.value).toEqual('application/json'); 144 | 145 | expect(segmentEvent.attributes['http.request.body.data']?.value).toBe(JSON.stringify({ foo: 'bar', other: 1 })); at /home/runner/work/_temp/test-application/tests/spans.test.ts:142:76
[chromium] β€Ί tests/spans.test.ts:4:5 β€Ί Sends an API route span: ../../_temp/test-application/tests/spans.test.ts#L17
3) [chromium] β€Ί tests/spans.test.ts:4:5 β€Ί Sends an API route span ──────────────────────────────── Error: expect(received).toEqual(expected) // deep equality - Expected - 14 + Received + 173 @@ -1,40 +1,90 @@ - ObjectContaining { - "attributes": ObjectContaining { + Object { + "attributes": Object { + "app.free_memory": Object { + "type": "integer", + "value": 14498635776, + }, + "app.memory": Object { + "type": "integer", + "value": 386109440, + }, + "app.start_time": Object { + "type": "string", + "value": "2026-09-14T06:39:33.740Z", + }, "client.address": Object { "type": "string", "value": "::1", }, "client.port": Object { + "type": "integer", + "value": 42376, + }, + "culture.locale": Object { + "type": "string", + "value": "en-US", + }, + "culture.timezone": Object { + "type": "string", + "value": "UTC", + }, + "device.archs": Object { + "type": "array", + "value": Array [ + "x64", + ], + }, + "device.boot_time": Object { + "type": "string", + "value": "2026-09-14T06:36:48.915Z", + }, + "device.cpu_description": Object { + "type": "string", + "value": "AMD EPYC 9V74 80-Core Processor", + }, + "device.free_memory": Object { + "type": "integer", + "value": 14498635776, + }, + "device.memory_size": Object { "type": "integer", - "value": Any<Number>, + "value": 16766414848, + }, + "device.processor_count": Object { + "type": "integer", + "value": 4, + }, + "device.processor_frequency": Object { + "type": "integer", + "value": 0, }, "http.request.header.accept": Object { "type": "string", "value": "*/*", }, - "http.request.header.accept_encoding": Object { + "http.request.header.accept-encoding": Object { "type": "string", "value": "gzip, deflate", }, - "http.request.header.accept_language": Object { + "http.request.header.accept-language": Object { "type": "string", "value": "*", }, "http.request.header.connection": Object { "type": "string", "value": "keep-alive", }, "http.request.header.host": Object { "type": "string", - "value": Any<String>, + "value": "localhost:3030", }, - "http.request.header.sec_fetch_mode": Object { + "http.request.header.sec-fetch-mode": Object { "type": "string", "value": "cors", }, - "http.request.header.user_agent": Object { + "http.request.header.user-agent": Object { "type": "string", "value": "node", }, "http.request.method": Object { "type": "string", @@ -52,23 +102,23 @@ "type": "string", "value": "/test-transaction", }, "network.local.address": Object { "type": "string", - "value": Any<String>, + "value": "::1", }, "network.local.port": Object { "type": "integer", - "value": Any<Number>, + "value": 3030, }, "network.peer.address": Object { "type": "string", - "value": Any<String>, + "value": "::1", }, "network.peer.port": Object { "type": "integer", - "value": Any<Number>, + "value": 42376, }, "network.protocol.name": Object {
[chromium] β€Ί tests/propagation.test.ts:146:5 β€Ί Propagates trace for outgoing fetch requests: ../../_temp/test-application/tests/propagation.test.ts#L205
2) [chromium] β€Ί tests/propagation.test.ts:146:5 β€Ί Propagates trace for outgoing fetch requests ─── Error: expect(received).toEqual(expected) // deep equality - Expected - 13 + Received + 172 @@ -1,40 +1,90 @@ - ObjectContaining { - "attributes": ObjectContaining { + Object { + "attributes": Object { + "app.free_memory": Object { + "type": "integer", + "value": 14476099584, + }, + "app.memory": Object { + "type": "integer", + "value": 375885824, + }, + "app.start_time": Object { + "type": "string", + "value": "2026-09-14T06:39:33.740Z", + }, "client.address": Object { "type": "string", "value": "::1", }, "client.port": Object { "type": "integer", - "value": Any<Number>, + "value": 42358, + }, + "culture.locale": Object { + "type": "string", + "value": "en-US", + }, + "culture.timezone": Object { + "type": "string", + "value": "UTC", + }, + "device.archs": Object { + "type": "array", + "value": Array [ + "x64", + ], + }, + "device.boot_time": Object { + "type": "string", + "value": "2026-09-14T06:36:48.915Z", + }, + "device.cpu_description": Object { + "type": "string", + "value": "AMD EPYC 9V74 80-Core Processor", + }, + "device.free_memory": Object { + "type": "integer", + "value": 14476099584, + }, + "device.memory_size": Object { + "type": "integer", + "value": 16766414848, + }, + "device.processor_count": Object { + "type": "integer", + "value": 4, }, + "device.processor_frequency": Object { + "type": "integer", + "value": 0, + }, "http.request.header.accept": Object { "type": "string", "value": "*/*", }, - "http.request.header.accept_encoding": Object { + "http.request.header.accept-encoding": Object { "type": "string", "value": "gzip, deflate", }, - "http.request.header.accept_language": Object { + "http.request.header.accept-language": Object { "type": "string", "value": "*", }, "http.request.header.connection": Object { "type": "string", "value": "keep-alive", }, "http.request.header.host": Object { "type": "string", - "value": Any<String>, + "value": "localhost:3030", }, - "http.request.header.sec_fetch_mode": Object { + "http.request.header.sec-fetch-mode": Object { "type": "string", "value": "cors", }, - "http.request.header.user_agent": Object { + "http.request.header.user-agent": Object { "type": "string", "value": "node", }, "http.request.method": Object { "type": "string", @@ -52,23 +102,23 @@ "type": "string", "value": "/test-outgoing-fetch/:id", }, "network.local.address": Object { "type": "string", - "value": Any<String>, + "value": "::1", }, "network.local.port": Object { "type": "integer", - "value": Any<Number>, + "value": 3030, }, "network.peer.address": Object { "type": "string", - "value": Any<String>, + "value": "::1", }, "network.peer.port": Object { "type": "integer", - "value": Any<Number>, + "value": 42358, }, "network.protocol.name": Object { "type": "string", "value": "h
[chromium] β€Ί tests/propagation.test.ts:5:5 β€Ί Propagates trace for outgoing http requests: ../../_temp/test-application/tests/propagation.test.ts#L64
1) [chromium] β€Ί tests/propagation.test.ts:5:5 β€Ί Propagates trace for outgoing http requests ────── Error: expect(received).toEqual(expected) // deep equality - Expected - 12 + Received + 171 @@ -1,24 +1,74 @@ - ObjectContaining { - "attributes": ObjectContaining { + Object { + "attributes": Object { + "app.free_memory": Object { + "type": "integer", + "value": 14523940864, + }, + "app.memory": Object { + "type": "integer", + "value": 372346880, + }, + "app.start_time": Object { + "type": "string", + "value": "2026-09-14T06:39:33.740Z", + }, "client.address": Object { "type": "string", "value": "::1", }, "client.port": Object { "type": "integer", - "value": Any<Number>, + "value": 42330, + }, + "culture.locale": Object { + "type": "string", + "value": "en-US", + }, + "culture.timezone": Object { + "type": "string", + "value": "UTC", + }, + "device.archs": Object { + "type": "array", + "value": Array [ + "x64", + ], + }, + "device.boot_time": Object { + "type": "string", + "value": "2026-09-14T06:36:48.915Z", + }, + "device.cpu_description": Object { + "type": "string", + "value": "AMD EPYC 9V74 80-Core Processor", + }, + "device.free_memory": Object { + "type": "integer", + "value": 14523940864, + }, + "device.memory_size": Object { + "type": "integer", + "value": 16766414848, + }, + "device.processor_count": Object { + "type": "integer", + "value": 4, + }, + "device.processor_frequency": Object { + "type": "integer", + "value": 0, }, "http.request.header.accept": Object { "type": "string", "value": "*/*", }, - "http.request.header.accept_encoding": Object { + "http.request.header.accept-encoding": Object { "type": "string", "value": "gzip, deflate", }, - "http.request.header.accept_language": Object { + "http.request.header.accept-language": Object { "type": "string", "value": "*", }, "http.request.header.connection": Object { "type": "string", @@ -26,15 +76,15 @@ }, "http.request.header.host": Object { "type": "string", "value": "localhost:3030", }, - "http.request.header.sec_fetch_mode": Object { + "http.request.header.sec-fetch-mode": Object { "type": "string", "value": "cors", }, - "http.request.header.user_agent": Object { + "http.request.header.user-agent": Object { "type": "string", "value": "node", }, "http.request.method": Object { "type": "string", @@ -52,23 +102,23 @@ "type": "string", "value": "/test-outgoing-http/:id", }, "network.local.address": Object { "type": "string", - "value": Any<String>, + "value": "::1", }, "network.local.port": Object { "type": "integer", - "value": Any<Number>, + "value": 3030, }, "network.peer.address": Object { "type": "string", - "value": Any<String>, + "value": "::1", }, "network.peer.port": Object { "type": "integer", - "value": Any<Number>, + "value": 42330, }, "network.protocol.name": Object { "type": "string", "value": "http", }, @@ -77,11 +127,35
E2E solidstart-static Test
Process completed with exit code 1.
[chromium] β€Ί tests/db.test.ts:44:1 β€Ί Instruments mysql automatically via build-time orchestrion: ../../_temp/test-application/tests/db.test.ts#L56
2) [chromium] β€Ί tests/db.test.ts:44:1 β€Ί Instruments mysql automatically via build-time orchestrion Error: expect(received).toContainEqual(expected) // deep equality Expected value: ObjectContaining {"data": ObjectContaining {"db.connection_string": Any<String>, "db.query.text": "SELECT ? + ? AS solution", "db.system.name": "mysql", "db.user": "root", "server.address": Any<String>, "server.port": 3306}, "description": "SELECT ? + ? AS solution", "op": "db", "origin": "auto.db.mysql", "status": "ok"} Received array: [{"data": {"db.connection_string": "jdbc:mysql://localhost:3306", "db.query.summary": "SELECT", "db.query.text": "SELECT ? + ? AS solution", "db.system.name": "mysql", "db.user": "root", "error.type": "TypeError", "sentry.kind": "client", "sentry.op": "db", "sentry.origin": "auto.db.mysql", "server.address": "localhost", "server.port": 3306}, "description": "SELECT ? + ? AS solution", "op": "db", "origin": "auto.db.mysql", "parent_span_id": "a1b8bae318786e54", "span_id": "99d2483fd92353a9", "start_timestamp": 1789368036.7674308, "status": "internal_error", "timestamp": 1789368036.7679288, "trace_id": "9e8d10d940d54f178ead1836f6ffc815"}] 54 | const spans = transactionEvent.spans || []; 55 | > 56 | expect(spans).toContainEqual( | ^ 57 | expect.objectContaining({ 58 | op: 'db', 59 | origin: 'auto.db.mysql', at /home/runner/work/_temp/test-application/tests/db.test.ts:56:17
[chromium] β€Ί tests/db.test.ts:4:1 β€Ί Instruments ioredis automatically via build-time orchestrion: ../../_temp/test-application/tests/db.test.ts#L16
1) [chromium] β€Ί tests/db.test.ts:4:1 β€Ί Instruments ioredis automatically via build-time orchestrion Error: expect(received).toContainEqual(expected) // deep equality Expected value: ObjectContaining {"data": ObjectContaining {"db.operation.name": "set", "db.query.text": "set test-key [1 other arguments]", "db.system.name": "redis"}, "description": "set test-key [1 other arguments]", "op": "db.query", "origin": "auto.db.redis", "status": "ok"} Received array: [] 14 | const spans = transactionEvent.spans || []; 15 | > 16 | expect(spans).toContainEqual( | ^ 17 | expect.objectContaining({ 18 | op: 'db.query', 19 | origin: 'auto.db.redis', at /home/runner/work/_temp/test-application/tests/db.test.ts:16:17
E2E solidstart Test
Process completed with exit code 1.
[chromium] β€Ί tests/db.test.ts:57:1 β€Ί Instruments mysql automatically via build-time orchestrion: ../../_temp/test-application/tests/db.test.ts#L0
2) [chromium] β€Ί tests/db.test.ts:57:1 β€Ί Instruments mysql automatically via build-time orchestrion Test timeout of 30000ms exceeded.
[chromium] β€Ί tests/db.test.ts:4:1 β€Ί Instruments ioredis automatically via build-time orchestrion: ../../_temp/test-application/tests/db.test.ts#L0
1) [chromium] β€Ί tests/db.test.ts:4:1 β€Ί Instruments ioredis automatically via build-time orchestrion Test timeout of 30000ms exceeded.
[chromium] β€Ί tests/errors/errors.server.test.ts:70:3 β€Ί server - instrumentation API error capture β€Ί error and segment span should share the same trace: ../../_temp/test-application/tests/errors/errors.server.test.ts#L86
1) [chromium] β€Ί tests/errors/errors.server.test.ts:70:3 β€Ί server - instrumentation API error capture β€Ί error and segment span should share the same trace Error: expect(received).toBe(expected) // Object.is equality Expected: "5442fb093efd48fa80120abe3f166f64" Received: "058f312acfb34893a5e7a17156c92a4c" 84 | 85 | // Error and segment span should have the same trace_id > 86 | expect(error.contexts?.trace?.trace_id).toBe(span.trace_id); | ^ 87 | }); 88 | 89 | // Skipped in dev: the action error is sometimes captured via the client instrumentation path at /home/runner/work/_temp/test-application/tests/errors/errors.server.test.ts:86:45
E2E react-send-to-sentry Test (optional)
Process completed with exit code 1.
Node (26) Integration Tests
Process completed with exit code 1.
suites/esbuild/orchestrion-bundled/test.ts > esbuild + orchestrion build-time instrumentation > instruments the dependency and stays quiet when `@sentry/server-runtime-injection` is kept external: dev-packages/node-integration-tests/suites/esbuild/orchestrion-bundled/test.ts#L143
AssertionError: expected 'DEP_LOADED bundler_marker=false runti…' to contain 'runtime=["dataloader"]' - Expected + Received - runtime=["dataloader"] + DEP_LOADED bundler_marker=false runtime=["dataloader","dataloader"] + ❯ suites/esbuild/orchestrion-bundled/test.ts:143:20
Node (24) Integration Tests
Process completed with exit code 1.
suites/esbuild/orchestrion-bundled/test.ts > esbuild + orchestrion build-time instrumentation > instruments the dependency and stays quiet when `@sentry/server-runtime-injection` is kept external: dev-packages/node-integration-tests/suites/esbuild/orchestrion-bundled/test.ts#L143
AssertionError: expected 'DEP_LOADED bundler_marker=false runti…' to contain 'runtime=["dataloader"]' - Expected + Received - runtime=["dataloader"] + DEP_LOADED bundler_marker=false runtime=["dataloader","dataloader"] + ❯ suites/esbuild/orchestrion-bundled/test.ts:143:20
Node (24) (TS 5.0) Integration Tests
Process completed with exit code 1.
suites/esbuild/orchestrion-bundled/test.ts > esbuild + orchestrion build-time instrumentation > instruments the dependency and stays quiet when `@sentry/server-runtime-injection` is kept external: dev-packages/node-integration-tests/suites/esbuild/orchestrion-bundled/test.ts#L143
AssertionError: expected 'DEP_LOADED bundler_marker=false runti…' to contain 'runtime=["dataloader"]' - Expected + Received - runtime=["dataloader"] + DEP_LOADED bundler_marker=false runtime=["dataloader","dataloader"] + ❯ suites/esbuild/orchestrion-bundled/test.ts:143:20
All required jobs passed or were skipped
Process completed with exit code 1.
🎭 Playwright Run Summary
1 passed (3.4s)
🎭 Playwright Run Summary
1 passed (3.4s)
🎭 Playwright Run Summary
1 skipped 19 passed (8.5s)
🎭 Playwright Run Summary
4 passed (7.0s)
🎭 Playwright Run Summary
1 skipped 19 passed (1.5s)
🎭 Playwright Run Summary
2 passed (3.4s)
🎭 Playwright Run Summary
3 passed (3.9s)
🎭 Playwright Run Summary
2 passed (4.5s)
🎭 Playwright Run Summary
11 skipped 2 passed (3.5s)
🎭 Playwright Run Summary
16 passed (8.3s)
🎭 Playwright Run Summary
4 passed (5.0s)
🎭 Playwright Run Summary
2 passed (5.0s)
🎭 Playwright Run Summary
13 passed (12.5s)
🎭 Playwright Run Summary
6 passed (14.7s)
🎭 Playwright Run Summary
12 passed (8.6s)
🎭 Playwright Run Summary
1 passed (6.1s)
🎭 Playwright Run Summary
5 passed (12.3s)
🎭 Playwright Run Summary
8 passed (13.6s)
🎭 Playwright Run Summary
7 passed (3.3s)
🎭 Playwright Run Summary
22 passed (17.4s)
🎭 Playwright Run Summary
5 passed (10.0s)
🎭 Playwright Run Summary
16 passed (20.1s)
🎭 Playwright Run Summary
4 failed [chromium] β€Ί tests/propagation.test.ts:5:5 β€Ί Propagates trace for outgoing http requests ─────── [chromium] β€Ί tests/propagation.test.ts:146:5 β€Ί Propagates trace for outgoing fetch requests ──── [chromium] β€Ί tests/spans.test.ts:4:5 β€Ί Sends an API route span ───────────────────────────────── [chromium] β€Ί tests/spans.test.ts:119:5 β€Ί Captures request metadata ───────────────────────────── 7 passed (13.8s)
🎭 Playwright Run Summary
2 passed (17.9s)
🎭 Playwright Run Summary
11 passed (9.6s)
🎭 Playwright Run Summary
5 passed (13.8s)
🎭 Playwright Run Summary
8 passed (5.5s)
🎭 Playwright Run Summary
11 passed (10.1s)
🎭 Playwright Run Summary
3 skipped 17 passed (7.7s)
🎭 Playwright Run Summary
5 passed (12.9s)
🎭 Playwright Run Summary
23 passed (23.4s)
🎭 Playwright Run Summary
9 passed (13.0s)
🎭 Playwright Run Summary
4 passed (5.8s)
🎭 Playwright Run Summary
12 passed (8.5s)
🎭 Playwright Run Summary
3 passed (5.2s)
🎭 Playwright Run Summary
10 passed (8.5s)
🎭 Playwright Run Summary
15 passed (8.5s)
🎭 Playwright Run Summary
2 skipped 14 passed (14.7s)
🎭 Playwright Run Summary
5 passed (7.1s)
🎭 Playwright Run Summary
4 passed (5.2s)
🎭 Playwright Run Summary
5 passed (6.6s)
🎭 Playwright Run Summary
11 passed (10.0s)
🎭 Playwright Run Summary
4 passed (9.0s)
🎭 Playwright Run Summary
4 passed (31.2s)
🎭 Playwright Run Summary
4 passed (3.1s)
🎭 Playwright Run Summary
16 passed (10.3s)
🎭 Playwright Run Summary
6 passed (13.4s)
🎭 Playwright Run Summary
3 passed (15.3s)
🎭 Playwright Run Summary
3 passed (9.6s)
🎭 Playwright Run Summary
5 passed (11.1s)
🎭 Playwright Run Summary
5 passed (8.7s)
🎭 Playwright Run Summary
8 passed (8.1s)
🎭 Playwright Run Summary
5 passed (15.6s)
🎭 Playwright Run Summary
8 skipped 3 passed (4.3s)
🎭 Playwright Run Summary
2 passed (30.7s)
🎭 Playwright Run Summary
11 passed (17.6s)
🎭 Playwright Run Summary
2 skipped 7 passed (26.6s)
🎭 Playwright Run Summary
2 passed (4.0s)
🎭 Playwright Run Summary
2 passed (4.2s)
🎭 Playwright Run Summary
4 passed (11.4s)
🎭 Playwright Run Summary
1 skipped 73 passed (14.5s)
🎭 Playwright Run Summary
1 passed (6.1s)
🎭 Playwright Run Summary
1 passed (4.3s)
🎭 Playwright Run Summary
23 passed (12.3s)
🎭 Playwright Run Summary
11 passed (19.9s)
🎭 Playwright Run Summary
9 passed (3.7s)
🎭 Playwright Run Summary
9 passed (3.7s)
🎭 Playwright Run Summary
5 passed (9.7s)
🎭 Playwright Run Summary
1 skipped 16 passed (32.8s)
🎭 Playwright Run Summary
3 passed (15.5s)
🎭 Playwright Run Summary
3 passed (10.1s)
🎭 Playwright Run Summary
1 passed (2.9s)
🎭 Playwright Run Summary
13 passed (15.3s)
🎭 Playwright Run Summary
1 passed (3.2s)
🎭 Playwright Run Summary
1 passed (3.1s)
🎭 Playwright Run Summary
30 passed (36.3s)
🎭 Playwright Run Summary
2 passed (32.5s)
🎭 Playwright Run Summary
13 passed (15.9s)
🎭 Playwright Run Summary
4 failed [chromium] β€Ί tests/propagation.test.ts:5:5 β€Ί Propagates trace for outgoing http requests ─────── [chromium] β€Ί tests/propagation.test.ts:146:5 β€Ί Propagates trace for outgoing fetch requests ──── [chromium] β€Ί tests/spans.test.ts:4:5 β€Ί Sends an API route span ───────────────────────────────── [chromium] β€Ί tests/spans.test.ts:119:5 β€Ί Captures request metadata ───────────────────────────── 7 passed (11.7s)
🎭 Playwright Run Summary
3 passed (3.3s)
🎭 Playwright Run Summary
11 passed (9.7s)
🎭 Playwright Run Summary
3 passed (5.7s)
🎭 Playwright Run Summary
4 passed (11.8s)
🎭 Playwright Run Summary
6 passed (13.6s)
🎭 Playwright Run Summary
1 passed (4.4s)
🎭 Playwright Run Summary
1 skipped 73 passed (13.4s)
🎭 Playwright Run Summary
5 passed (10.5s)
🎭 Playwright Run Summary
6 passed (34.8s)
🎭 Playwright Run Summary
16 passed (20.2s)
🎭 Playwright Run Summary
13 passed (30.4s)
🎭 Playwright Run Summary
3 passed (17.1s)
🎭 Playwright Run Summary
3 passed (10.5s)
🎭 Playwright Run Summary
7 passed (16.6s)
🎭 Playwright Run Summary
2 skipped 10 passed (8.2s)
🎭 Playwright Run Summary
2 skipped 10 passed (6.8s)
🎭 Playwright Run Summary
25 passed (22.9s)
🎭 Playwright Run Summary
10 passed (17.8s)
🎭 Playwright Run Summary
1 skipped 10 passed (15.3s)
🎭 Playwright Run Summary
4 passed (3.2s)
🎭 Playwright Run Summary
13 passed (37.9s)
🎭 Playwright Run Summary
1 skipped 73 passed (14.5s)
🎭 Playwright Run Summary
4 passed (4.5s)
🎭 Playwright Run Summary
3 passed (6.1s)
🎭 Playwright Run Summary
5 passed (12.8s)
🎭 Playwright Run Summary
9 passed (30.9s)
🎭 Playwright Run Summary
21 skipped 2 passed (2.9s)
🎭 Playwright Run Summary
2 passed (28.7s)
🎭 Playwright Run Summary
22 passed (35.6s)
🎭 Playwright Run Summary
7 passed (11.3s)
🎭 Playwright Run Summary
9 passed (11.1s)
🎭 Playwright Run Summary
13 passed (33.4s)
🎭 Playwright Run Summary
10 passed (12.8s)
🎭 Playwright Run Summary
8 passed (11.8s)
🎭 Playwright Run Summary
1 passed (4.2s)
🎭 Playwright Run Summary
7 passed (6.9s)
🎭 Playwright Run Summary
13 passed (37.9s)
🎭 Playwright Run Summary
12 passed (8.2s)
🎭 Playwright Run Summary
23 passed (18.3s)
🎭 Playwright Run Summary
4 passed (12.4s)
🎭 Playwright Run Summary
2 passed (15.0s)
🎭 Playwright Run Summary
5 passed (12.8s)
🎭 Playwright Run Summary
19 passed (13.0s)
🎭 Playwright Run Summary
3 passed (20.5s)
🎭 Playwright Run Summary
3 passed (13.1s)
🎭 Playwright Run Summary
21 skipped 2 passed (3.9s)
🎭 Playwright Run Summary
13 passed (30.4s)
🎭 Playwright Run Summary
21 skipped 2 passed (4.0s)
🎭 Playwright Run Summary
1 skipped 12 passed (25.5s)
🎭 Playwright Run Summary
9 passed (12.7s)
🎭 Playwright Run Summary
12 passed (37.6s)
🎭 Playwright Run Summary
53 passed (37.4s)
🎭 Playwright Run Summary
8 passed (15.7s)
🎭 Playwright Run Summary
4 passed (3.2s)
🎭 Playwright Run Summary
3 passed (5.0s)
🎭 Playwright Run Summary
13 passed (37.0s)
🎭 Playwright Run Summary
21 skipped 2 passed (3.5s)
🎭 Playwright Run Summary
6 passed (44.5s)
🎭 Playwright Run Summary
15 passed (31.2s)
🎭 Playwright Run Summary
12 passed (19.6s)
🎭 Playwright Run Summary
14 passed (32.6s)
🎭 Playwright Run Summary
10 passed (39.9s)
🎭 Playwright Run Summary
4 passed (10.5s)
🎭 Playwright Run Summary
13 passed (44.8s)
🎭 Playwright Run Summary
10 passed (38.8s)
🎭 Playwright Run Summary
9 passed (12.3s)
🎭 Playwright Run Summary
22 passed (45.4s)
🎭 Playwright Run Summary
13 passed (23.7s)
🎭 Playwright Run Summary
9 passed (12.0s)
🎭 Playwright Run Summary
12 passed (41.6s)
🎭 Playwright Run Summary
1 skipped 73 passed (14.9s)
🎭 Playwright Run Summary
11 passed (20.5s)
🎭 Playwright Run Summary
10 passed (29.7s)
🎭 Playwright Run Summary
22 passed (46.4s)
🎭 Playwright Run Summary
15 passed (19.6s)
🎭 Playwright Run Summary
13 passed (44.2s)
🎭 Playwright Run Summary
12 passed (31.6s)
🎭 Playwright Run Summary
10 passed (30.0s)
🎭 Playwright Run Summary
12 passed (17.5s)
🎭 Playwright Run Summary
12 passed (17.1s)
🎭 Playwright Run Summary
7 skipped 23 passed (11.3s)
🎭 Playwright Run Summary
7 skipped 23 passed (10.9s)
🎭 Playwright Run Summary
3 passed (18.2s)
🎭 Playwright Run Summary
3 passed (11.8s)
🎭 Playwright Run Summary
4 passed (16.0s)
🎭 Playwright Run Summary
4 skipped 50 passed (46.3s)
🎭 Playwright Run Summary
30 passed (30.4s)
🎭 Playwright Run Summary
1 skipped 11 passed (27.5s)
🎭 Playwright Run Summary
12 passed (9.7s)
🎭 Playwright Run Summary
8 skipped 22 passed (11.3s)
🎭 Playwright Run Summary
5 skipped 25 passed (11.4s)
🎭 Playwright Run Summary
4 passed (12.5s)
🎭 Playwright Run Summary
10 passed (21.1s)
🎭 Playwright Run Summary
10 passed (13.1s)
🎭 Playwright Run Summary
16 skipped 12 passed (27.7s)
🎭 Playwright Run Summary
40 passed (34.9s)
🎭 Playwright Run Summary
5 skipped 25 passed (17.6s)
🎭 Playwright Run Summary
2 passed (17.0s)
🎭 Playwright Run Summary
13 passed (36.9s)
🎭 Playwright Run Summary
16 skipped 12 passed (24.3s)
🎭 Playwright Run Summary
10 passed (22.9s)
🎭 Playwright Run Summary
10 passed (6.2s)
🎭 Playwright Run Summary
9 passed (13.2s)
🎭 Playwright Run Summary
17 passed (1.1m)
🎭 Playwright Run Summary
2 passed (30.3s)
🎭 Playwright Run Summary
15 passed (1.2m)
🎭 Playwright Run Summary
12 passed (40.1s)
🎭 Playwright Run Summary
2 passed (16.1s)
🎭 Playwright Run Summary
18 passed (49.7s)
🎭 Playwright Run Summary
2 passed (32.4s)
🎭 Playwright Run Summary
1 skipped 29 passed (19.3s)
🎭 Playwright Run Summary
9 passed (32.1s)
🎭 Playwright Run Summary
3 passed (23.3s)
🎭 Playwright Run Summary
3 passed (4.4s)
🎭 Playwright Run Summary
12 passed (39.7s)
🎭 Playwright Run Summary
22 passed (51.4s)
🎭 Playwright Run Summary
3 passed (38.0s)
🎭 Playwright Run Summary
22 passed (49.3s)
🎭 Playwright Run Summary
6 skipped 7 passed (34.9s)
🎭 Playwright Run Summary
13 passed (18.8s)
🎭 Playwright Run Summary
9 passed (21.3s)
🎭 Playwright Run Summary
9 passed (8.6s)
🎭 Playwright Run Summary
4 skipped 26 passed (17.5s)
🎭 Playwright Run Summary
12 passed (40.3s)
🎭 Playwright Run Summary
13 passed (38.9s)
🎭 Playwright Run Summary
13 passed (14.0s)
🎭 Playwright Run Summary
4 skipped 12 passed (30.1s)
🎭 Playwright Run Summary
2 skipped 14 passed (15.1s)
🎭 Playwright Run Summary
2 passed (19.8s)
🎭 Playwright Run Summary
15 passed (51.4s)
🎭 Playwright Run Summary
40 passed (35.1s)
🎭 Playwright Run Summary
3 passed (34.8s)
🎭 Playwright Run Summary
3 passed (13.9s)
🎭 Playwright Run Summary
2 failed [chromium] β€Ί tests/db.test.ts:4:1 β€Ί Instruments ioredis automatically via build-time orchestrion [chromium] β€Ί tests/db.test.ts:44:1 β€Ί Instruments mysql automatically via build-time orchestrion 9 passed (46.5s)
🎭 Playwright Run Summary
5 passed (41.7s)
🎭 Playwright Run Summary
5 passed (13.3s)
🎭 Playwright Run Summary
13 passed (45.8s)
🎭 Playwright Run Summary
13 passed (14.6s)
🎭 Playwright Run Summary
4 skipped 12 passed (30.3s)
🎭 Playwright Run Summary
2 skipped 14 passed (15.0s)
🎭 Playwright Run Summary
9 passed (45.3s)
🎭 Playwright Run Summary
9 passed (7.2s)
🎭 Playwright Run Summary
11 passed (41.5s)
🎭 Playwright Run Summary
4 passed (33.5s)
🎭 Playwright Run Summary
4 passed (10.6s)
🎭 Playwright Run Summary
2 passed (19.0s)
🎭 Playwright Run Summary
2 skipped 21 passed (37.8s)
🎭 Playwright Run Summary
2 passed (19.9s)
🎭 Playwright Run Summary
2 skipped 21 passed (44.0s)
🎭 Playwright Run Summary
3 passed (35.2s)
🎭 Playwright Run Summary
3 passed (8.5s)
🎭 Playwright Run Summary
1 skipped 11 passed (49.8s)
🎭 Playwright Run Summary
12 passed (8.9s)
🎭 Playwright Run Summary
2 passed (16.8s)
🎭 Playwright Run Summary
18 passed (1.0m)
🎭 Playwright Run Summary
17 passed (1.1m)
🎭 Playwright Run Summary
7 passed (6.0s)
🎭 Playwright Run Summary
10 passed (55.2s)
🎭 Playwright Run Summary
2 passed (22.6s)
🎭 Playwright Run Summary
13 passed (51.6s)
🎭 Playwright Run Summary
13 passed (48.8s)
🎭 Playwright Run Summary
13 passed (15.0s)
🎭 Playwright Run Summary
2 passed (25.8s)
🎭 Playwright Run Summary
15 passed (1.2m)
🎭 Playwright Run Summary
6 skipped 7 passed (38.7s)
🎭 Playwright Run Summary
13 passed (19.2s)
🎭 Playwright Run Summary
489 skipped 193 passed (31.6s)
🎭 Playwright Run Summary
14 passed (16.6s)
🎭 Playwright Run Summary
2 failed [chromium] β€Ί tests/db.test.ts:4:1 β€Ί Instruments ioredis automatically via build-time orchestrion [chromium] β€Ί tests/db.test.ts:57:1 β€Ί Instruments mysql automatically via build-time orchestrion 9 passed (1.7m)
🎭 Playwright Run Summary
484 skipped 198 passed (33.1s)
🎭 Playwright Run Summary
487 skipped 195 passed (36.6s)
🎭 Playwright Run Summary
66 passed (2.2m)
🎭 Playwright Run Summary
1 skipped 5 passed (30.0s)
🎭 Playwright Run Summary
58 passed (1.7m)
🎭 Playwright Run Summary
1 flaky [chromium] β€Ί tests/errors/errors.server.test.ts:70:3 β€Ί server - instrumentation API error capture β€Ί error and segment span should share the same trace 4 skipped 29 passed (1.1m)
🎭 Playwright Run Summary
2 skipped 32 passed (1.5m)
🎭 Playwright Run Summary
5 skipped 30 passed (1.3m)
🎭 Playwright Run Summary
5 skipped 30 passed (50.4s)
🎭 Playwright Run Summary
1 skipped 5 passed (29.4s)
🎭 Playwright Run Summary
58 passed (1.7m)
🎭 Playwright Run Summary
43 passed (2.5m)
🎭 Playwright Run Summary
352 skipped 330 passed (1.4m)
🎭 Playwright Run Summary
1 skipped 5 passed (31.4s)
🎭 Playwright Run Summary
66 passed (2.2m)
🎭 Playwright Run Summary
1 skipped 5 passed (26.4s)
🎭 Playwright Run Summary
66 passed (2.2m)
🎭 Playwright Run Summary
5 skipped 30 passed (1.9m)
🎭 Playwright Run Summary
4 skipped 31 passed (48.5s)
🎭 Playwright Run Summary
353 skipped 329 passed (1.4m)
🎭 Playwright Run Summary
15 skipped 32 passed (1.8m)
🎭 Playwright Run Summary
5 skipped 42 passed (1.3m)
🎭 Playwright Run Summary
1 skipped 5 passed (30.5s)
🎭 Playwright Run Summary
58 passed (1.9m)
🎭 Playwright Run Summary
5 skipped 30 passed (2.1m)
🎭 Playwright Run Summary
4 skipped 31 passed (49.6s)
🎭 Playwright Run Summary
4 skipped 167 passed (1.8m)
🎭 Playwright Run Summary
9 passed (14.9s)
🎭 Playwright Run Summary
1 skipped 170 passed (1.8m)
🎭 Playwright Run Summary
1 skipped 5 passed (30.2s)
🎭 Playwright Run Summary
66 passed (2.3m)
🎭 Playwright Run Summary
193 skipped 489 passed (3.3m)
🎭 Playwright Run Summary
16 skipped 32 passed (1.8m)
🎭 Playwright Run Summary
5 skipped 43 passed (1.5m)
🎭 Playwright Run Summary
16 skipped 32 passed (1.7m)
🎭 Playwright Run Summary
5 skipped 43 passed (1.6m)
🎭 Playwright Run Summary
16 skipped 32 passed (1.9m)
🎭 Playwright Run Summary
5 skipped 43 passed (1.5m)
🎭 Playwright Run Summary
4 passed (21.6s)
🎭 Playwright Run Summary
2 skipped 32 passed (2.5m)
🎭 Playwright Run Summary
2 skipped 32 passed (1.3m)
🎭 Playwright Run Summary
5 skipped 165 passed (3.0m)
🎭 Playwright Run Summary
197 skipped 485 passed (3.1m)
🎭 Playwright Run Summary
4 skipped 166 passed (3.4m)
🎭 Playwright Run Summary
2 skipped 32 passed (2.7m)
🎭 Playwright Run Summary
2 skipped 32 passed (1.2m)
🎭 Playwright Run Summary
13 skipped 35 passed (2.8m)
🎭 Playwright Run Summary
5 skipped 43 passed (1.5m)
🎭 Playwright Run Summary
58 skipped 624 passed (4.0m)
🎭 Playwright Run Summary
187 skipped 495 passed (3.4m)
🎭 Playwright Run Summary
13 skipped 35 passed (2.8m)
🎭 Playwright Run Summary
5 skipped 43 passed (1.5m)
🎭 Playwright Run Summary
60 skipped 622 passed (4.0m)
🎭 Playwright Run Summary
13 skipped 35 passed (2.9m)
🎭 Playwright Run Summary
5 skipped 43 passed (1.6m)
🎭 Playwright Run Summary
60 skipped 622 passed (4.1m)
🎭 Playwright Run Summary
56 skipped 626 passed (4.2m)
🎭 Playwright Run Summary
56 skipped 626 passed (4.3m)